program: Gaussian 09
title: 000272837
version: EM64L-G09RevD.01
frameworkgroup: C1[X(C18H15NO3)]
method: RPBEPBE
basis: SDD
operation: Freq
keyword: #p
keyword: freq=noraman
keyword: PBEPBE/SDD
title: #p freq=noraman PBEPBE/SDD
converged: YES YES NO NO
title: Mulliken charges:
elementType: O O O N C C C C C C C C C C C C C C C C C C H H H H H H H H H H H H H H H
charge: -0.291348 -0.390089 -0.263276 0.004602 0.331010 0.165146 -0.280246 0.049790 -0.381123 0.338255 -0.399824 0.226176 -0.220200 0.182336 -0.413295 -0.379252 -0.366414 -0.248929 -0.230926 -0.239725 -0.255705 -0.664698 0.267955 0.301627 0.229121 0.221913 0.217886 0.295436 0.224744 0.227036 0.228516 0.235746 0.223616 0.356034 0.219220 0.227453 0.251432
chargesum: 0.00000
title: Mulliken charges with hydrogens summed into heavy atoms:
elementType: O O O N C C C C C C C C C C C C C C C C C C
charge: -0.291348 -0.034056 -0.263276 0.004602 0.331010 0.165146 -0.280246 0.049790 -0.113168 0.338255 -0.098198 0.226176 0.008920 0.182336 -0.191382 -0.161366 -0.070978 -0.024185 -0.003891 -0.011208 0.203658 0.033409
polarizability: 3.19855389e+02 -3.80998677e+01 3.03857104e+02 3.27255652e+00 4.93453675e+00 9.22678329e+01
1716.lowfreq: -3.8208 -0.0007 -0.0006 -0.0005 4.5105 5.0143 17.5432 20.8008 47.5797
frequency: 17.4305 20.7286 47.5770 54.6245 71.1174 88.4210 99.5334 143.6656 169.6268 183.4500 215.6334 216.2974 246.2998 273.2039 277.6459 321.7481 324.6465 361.1713 401.2157 403.3499 416.5098 442.7407 463.6708 473.4336 506.4571 532.3178 553.0911 583.6156 589.9325 613.0208 620.0317 688.8670 697.7164 698.3109 715.0845 739.9827 766.8834 783.3669 788.5691 821.6257 824.7828 837.9846 855.8552 875.5716 882.7781 888.6365 939.1343 942.7985 987.5098 987.9729 988.5687 1005.8580 1015.9562 1023.6975 1042.4825 1059.6853 1082.0400 1091.2180 1095.5888 1136.6540 1154.7067 1171.4977 1181.3092 1190.2862 1212.3783 1242.5147 1261.2205 1280.1834 1287.2522 1309.6176 1329.3251 1344.5546 1357.0340 1372.0145 1387.4501 1391.1671 1414.3138 1438.8655 1456.5361 1463.3487 1463.5035 1484.9360 1486.2931 1508.2236 1542.7147 1578.6400 1587.6424 1607.5358 1611.9398 1618.5316 2993.8973 3031.0950 3088.7113 3094.3772 3115.2251 3119.8850 3124.2294 3134.1957 3146.9004 3150.6495 3158.9789 3168.9217 3196.6965 3200.9430 3561.4053
redmass: 4.1319 3.8376 3.9639 5.3184 5.6199 4.0713 5.2632 3.1233 4.7875 5.1184 4.2817 1.4837 3.7064 4.7308 6.2914 4.4309 3.6649 6.8292 1.7242 1.5658 4.0338 4.6889 3.5025 5.3082 6.9526 6.4453 3.6867 6.0746 5.7350 6.6940 6.7379 3.5709 1.7191 4.9262 5.9899 6.3962 1.5334 2.1144 2.0728 1.8369 3.3705 6.0120 1.2717 6.1266 4.5172 1.4407 1.4092 1.6008 1.3374 1.3226 6.0627 2.9119 1.3430 2.5511 4.0177 2.6074 1.8400 1.9792 2.1419 2.1787 1.6606 1.0584 1.2967 1.1429 1.9966 1.6630 2.3029 1.1179 2.6454 2.8880 1.8399 5.0480 1.3555 4.2708 7.4612 1.2328 2.7043 2.4655 1.1025 1.0521 2.7853 1.1140 2.4677 4.1109 6.0847 7.5199 6.1401 6.1473 6.8751 8.1902 1.0361 1.0591 1.0976 1.1033 1.0894 1.1060 1.0846 1.0882 1.0933 1.0932 1.0963 1.0995 1.0947 1.0906 1.0657
irintensity: 0.7242 0.1751 0.5697 2.8023 0.2531 0.2481 0.1238 1.6267 0.5060 10.0476 0.7967 3.3143 0.9764 1.3231 4.7802 5.1357 14.3483 2.4031 51.9525 63.0642 10.5238 2.5113 7.2125 1.1352 5.1209 10.2427 1.3441 0.2330 0.1170 6.8521 11.0902 4.7677 51.8877 1.5870 8.3051 18.2174 80.1080 11.5311 28.4205 0.3824 29.1020 10.0499 0.5439 4.1808 83.8243 1.5300 8.6757 8.8247 1.8670 1.6771 0.1221 70.1333 1.4169 10.8228 45.2720 5.7192 40.0592 120.1445 20.3911 453.1996 25.6194 2.3133 33.2193 27.1255 87.7783 104.7946 40.9456 2.7837 0.6628 18.4953 29.1069 7.3249 8.2465 40.1875 1.4874 24.7949 30.4627 41.5976 24.8530 11.6154 16.2887 15.2769 8.3476 11.2433 149.2234 65.4111 9.9314 11.3532 32.1608 59.5917 21.4402 35.4874 38.5488 1.7048 21.0867 26.4340 1.7996 7.9091 35.0747 20.2591 19.0440 28.9121 14.3502 0.4170 37.8881
temp: 298.150 k
press: 1.00000 atm
elementType: 8 8 8 7 6 6 6 6 6 6 6 6 6 6 6 6 6 6 6 6 6 6 1 1 1 1 1 1 1 1 1 1 1 1 1 1 1
symmnumber: 1
zpe: 747779.9 jmol-1
zpe.correction: 0.284814 hartree
zpe.thermalcorrener: 0.303765 hartree
zpe.thermalcorrenthalpy: 0.304709 hartree
zpe.thermalcorrgfe: 0.235313 hartree
zpe.sumelectzpe: -973.814339 hartree
zpe.sumelectthermal: -973.795388 hartree
zpe.sumelectthermalent: -973.794444 hartree
zpe.sumelectthermalfe: -973.863840 hartree
dipole: -0.9143 -0.4708 0.1553
dipole: 1.0401
quadrupole: -121.2148 -89.4428 -132.8180
quadrupole: 1.7930 -0.2304 1.4140
quadrupole: -6.7230 25.0491 -18.3261 1.7930 -0.2304 1.4140
hfenergy: -974.0991529 hartree
pointgroup: C01 [X(C18H15N1O3)]
dipole: 0.3415204 0.2235117 0.0291636 debye
polarizability: 326.6779188|-36.8019039|294.5176654|-9.7357758|-19.7697345|94.7847415 unknown
InChI: InChI=1S/C18H15NO3/c1-2-22-18(21)14-11-15(12-7-4-3-5-8-12)19-17-13(14)9-6-10-16(17)20/h3-11,20H,2H2,1H3
charge 0 multiplicity 1
37 atoms
O  2.07669 2.582789 -0.488882
O  -0.610115 -4.067954 0.658861
O  3.761329 0.988711 -0.351246
N  -0.847652 -1.389298 0.312857
C  1.623815 -1.107606 0.088767
C  1.40161 0.3146 -0.092698
C  0.423014 -1.909403 0.288083
C  -1.02581 -0.055806 0.144555
C  0.093253 0.814951 -0.062273
C  -2.430419 0.446961 0.184775
C  2.904448 -1.747124 0.082249
C  0.565854 -3.337279 0.472828
C  2.994089 -3.129743 0.265962
C  2.536723 1.271691 -0.312792
C  1.833814 -3.931858 0.46137
C  -2.751483 1.827019 0.063331
C  -3.492055 -0.485553 0.353256
C  -4.093927 2.26047 0.108437
C  -4.831198 -0.051426 0.397165
C  -5.140643 1.324841 0.274999
C  3.121905 3.630982 -0.697101
C  3.643321 4.153291 0.644643
H  -0.051769 1.885946 -0.203679
H  3.799384 -1.142106 -0.066576
H  3.977084 -3.61291 0.260138
H  1.936076 -5.01584 0.602436
H  -1.963243 2.576446 -0.063915
H  -3.229841 -1.543662 0.447741
H  -4.322741 3.327961 0.014407
H  -5.635872 -0.783895 0.526746
H  -6.18229 1.663357 0.309733
H  3.936539 3.198165 -1.303507
H  2.592554 4.41034 -1.268325
H  -0.398249 -5.028868 0.775011
H  4.346775 4.98843 0.469358
H  2.81552 4.526124 1.272179
H  4.180012 3.361155 1.192607
