program: Gaussian 09
title: 000272860
version: EM64L-G09RevD.01
frameworkgroup: C1[X(C22H19NO2S)]
method: RPBEPBE
basis: SDD
operation: Freq
keyword: #p
keyword: freq=noraman
keyword: PBEPBE/SDD
title: #p freq=noraman PBEPBE/SDD
converged: YES YES NO NO
title: Mulliken charges:
elementType: S O O N C C C C C C C C C C C C C C C C C C C C C C H H H H H H H H H H H H H H H H H H H
charge: 0.005136 -0.263324 -0.157991 -0.111642 -0.579170 -0.521185 0.504279 0.500877 0.083206 0.224060 -0.372320 -0.450221 -0.398493 -0.364074 0.314410 -0.359416 -0.243507 -0.219148 -0.239688 -0.230362 -0.362080 -0.225033 -0.240927 -0.241660 -0.226316 -0.352067 0.265056 0.242144 0.259955 0.247595 0.264394 0.237725 0.242510 0.236717 0.261926 0.229521 0.229652 0.226455 0.228678 0.271897 0.238641 0.229097 0.231406 0.240285 0.143003
chargesum: 0.00000
title: Mulliken charges with hydrogens summed into heavy atoms:
elementType: S O O N C C C C C C C C C C C C C C C C C C C C C C
charge: 0.148139 -0.263324 -0.157991 -0.111642 -0.071970 -0.013636 0.504279 0.500877 0.083206 0.224060 -0.107926 -0.212497 -0.155984 -0.127357 0.314410 -0.097489 -0.013986 0.010504 -0.013233 -0.001683 -0.090184 0.013608 -0.011830 -0.010253 0.013969 -0.352067
polarizability: 2.85387035e+02 2.28006769e+01 2.77461098e+02 -3.08051621e+01 -1.56068013e+01 2.09697799e+02
1716.lowfreq: -9.2858 -4.6281 -0.0011 -0.0005 0.0020 4.5686 10.2097 14.5746 18.5257
frequency: 9.4371 14.2580 18.2516 25.9191 31.2969 48.1632 57.7367 60.1573 90.9368 99.3723 105.4580 124.1338 193.1058 199.5725 216.0121 223.7135 257.2442 268.2627 311.7591 334.8928 360.2726 371.1589 390.5485 392.0728 403.7534 406.8497 416.9893 443.4850 464.7263 491.6097 497.4627 554.1687 590.7330 609.1840 615.7650 617.6920 633.3833 636.5618 667.0672 701.7161 705.9638 708.4485 725.8991 754.3603 759.2786 768.1908 781.2671 805.0237 809.8612 820.0285 856.6176 861.6985 881.4901 894.5401 912.1150 924.2476 935.9755 950.8515 968.5039 979.6567 982.4733 984.7015 990.3362 990.5688 998.6883 999.2484 1001.1006 1025.7989 1027.5096 1046.8735 1078.6853 1085.0375 1092.4215 1140.5993 1149.6045 1172.5884 1172.9174 1179.3421 1185.4814 1189.8918 1205.6629 1207.9678 1215.1601 1242.9871 1257.7531 1273.1545 1313.4299 1332.6806 1350.8952 1355.5112 1368.8744 1380.7002 1386.3494 1403.8868 1422.9673 1442.2894 1444.9535 1458.4473 1468.1354 1470.4080 1483.8252 1484.9269 1548.0210 1569.2458 1592.4011 1593.6326 1595.6159 1607.8245 1613.1171 1614.1542 2438.6790 2992.1083 3014.1314 3069.8600 3082.2483 3114.6836 3117.2252 3121.3563 3124.7139 3134.8411 3137.0402 3137.0816 3146.1723 3148.1040 3148.6340 3159.8945 3162.5871 3164.1510 3172.8383
redmass: 6.3345 6.1458 5.6079 6.2828 4.5124 6.5017 5.3220 5.4714 4.6185 5.4342 5.3103 8.4520 5.2110 4.7160 5.0658 4.8514 5.5939 4.4300 3.3115 4.3834 1.5470 6.2281 2.1834 2.5242 2.7862 2.8369 3.0704 6.8876 3.3588 4.0408 4.6190 4.5216 5.0841 4.1809 6.2319 6.2804 5.9042 6.0611 5.4486 4.0129 2.3564 1.9243 2.3922 2.4795 1.9764 3.0256 1.5623 3.4170 1.9872 3.4525 1.2514 1.2463 2.3463 1.6783 1.4572 2.5240 1.5376 1.9256 1.4031 1.3945 2.2200 1.4281 6.2051 6.2282 1.3455 1.3523 1.3214 2.2038 2.2502 2.2959 1.8996 1.5674 2.1498 1.8917 2.7857 1.0556 1.0567 1.0638 1.1127 1.1406 2.7878 2.8814 2.8149 1.6855 1.5373 1.4900 1.3663 1.2833 1.2970 1.4722 10.0872 6.7452 4.5765 2.6182 2.2366 2.1338 2.0858 1.1408 1.1741 2.5453 2.1776 2.1126 7.9307 6.9388 7.3585 6.0261 6.0733 8.4282 5.9899 6.0328 1.0378 1.0658 1.0612 1.0941 1.1014 1.0873 1.0871 1.0866 1.0866 1.0908 1.0858 1.0919 1.0959 1.0961 1.0898 1.0951 1.1015 1.1014 1.1010
irintensity: 0.2447 1.1530 0.0411 1.5375 0.2457 0.7388 0.6093 0.5236 1.7412 1.1240 0.3402 1.5775 1.4609 0.1184 0.5933 4.5477 3.7325 4.9032 0.0121 0.5002 21.0394 13.4504 8.4081 15.3304 0.2778 0.4099 7.5462 8.6422 0.9455 15.1044 6.2819 11.3311 2.8493 25.6397 0.3447 0.7030 6.2930 6.0731 46.7169 37.3732 25.0188 72.5310 7.2602 33.9972 76.8580 12.6969 60.1267 1.6143 34.3084 13.6575 0.3580 0.9109 5.5472 2.1116 2.1882 58.3599 7.1060 7.4192 3.7926 0.3986 44.5601 6.3063 0.3356 0.6536 2.6777 2.1598 0.9044 10.1938 6.5961 2.4231 26.8716 5.4648 21.6886 20.9620 6.9248 0.1017 0.1222 0.2068 1.2526 0.6179 58.7401 29.6605 11.7658 130.6705 43.8873 12.5097 9.4745 10.5232 16.3328 5.3122 4.7319 29.4736 6.3083 90.8393 11.8349 4.5692 8.2305 4.4692 31.2497 1.6158 8.4050 18.8102 220.4653 16.8271 101.3497 0.5905 2.0063 103.4942 2.9685 5.6622 5.0207 14.9347 29.9974 5.3290 5.0541 12.9225 3.4437 3.5450 0.4776 11.0769 1.1379 19.2842 30.8134 29.8308 5.0147 7.8434 23.5858 24.1053 22.4800
temp: 298.150 k
press: 1.00000 atm
elementType: 16 8 8 7 6 6 6 6 6 6 6 6 6 6 6 6 6 6 6 6 6 6 6 6 6 6 1 1 1 1 1 1 1 1 1 1 1 1 1 1 1 1 1 1 1
symmnumber: 1
zpe: 912416.3 jmol-1
zpe.correction: 0.347521 hartree
zpe.thermalcorrener: 0.370898 hartree
zpe.thermalcorrenthalpy: 0.371842 hartree
zpe.thermalcorrgfe: 0.289139 hartree
zpe.sumelectzpe: -1451.187503 hartree
zpe.sumelectthermal: -1451.164126 hartree
zpe.sumelectthermalent: -1451.163182 hartree
zpe.sumelectthermalfe: -1451.245885 hartree
dipole: -0.4504 2.9222 1.3309
dipole: 3.2425
quadrupole: -140.1941 -145.4104 -169.8046
quadrupole: 6.8821 -6.5665 -7.8278
quadrupole: 11.6089 6.3926 -18.0015 6.8821 -6.5665 -7.8278
hfenergy: -1451.5350243 hartree
pointgroup: C01 [X(C22H19N1O2S1)]
dipole: -0.9473468 0.662785 -0.5391082 debye
polarizability: 296.877205|14.7592135|263.1666415|-30.052187|-22.7657732|212.5020865 unknown
InChI: InChI=1S/C22H19NO2S/c24-21(19-13-7-8-14-20(19)22(25)26)23(15-17-9-3-1-4-10-17)16-18-11-5-2-6-12-18/h1-14,26H,15-16H2
charge 0 multiplicity 1
45 atoms
S  2.248987 -2.535256 -0.380588
O  0.533388 -1.309114 2.499254
O  0.618701 -2.672502 -2.575527
N  0.05209 0.143935 0.73651
C  0.823742 1.235701 1.401099
C  -0.54702 0.459229 -0.578788
C  2.13057 1.572709 0.691328
C  -1.540724 1.620246 -0.534791
C  -0.007245 -1.094243 1.3655
C  -0.854525 -2.192131 0.73982
C  3.280754 0.764571 0.886194
C  -1.507959 2.620671 -1.536171
C  2.221054 2.702215 -0.160871
C  -2.534991 1.691105 0.473812
C  -0.56459 -2.892797 -0.467934
C  -2.013521 -2.553793 1.473828
C  4.494804 1.07955 0.23725
C  -2.456028 3.669695 -1.538513
C  3.435316 3.018722 -0.812586
C  -3.479779 2.740334 0.477704
C  -1.467758 -3.884593 -0.94227
C  -2.890761 -3.555336 1.010056
C  4.575679 2.206837 -0.615213
C  -3.444653 3.733137 -0.530353
C  -2.622839 -4.218149 -0.21059
C  0.646159 -2.672498 -1.322952
H  1.01805 0.885227 2.428461
H  0.17146 2.126476 1.445318
H  -1.062714 -0.441199 -0.951102
H  0.262428 0.690085 -1.298394
H  3.216256 -0.104959 1.550027
H  -0.740861 2.576308 -2.319569
H  1.340534 3.341942 -0.303135
H  -2.560774 0.924236 1.257794
H  -2.215149 -2.039426 2.419004
H  5.37985 0.454501 0.402514
H  -2.420456 4.436014 -2.320957
H  3.49394 3.897826 -1.464367
H  -4.242725 2.785051 1.263117
H  -1.236153 -4.391448 -1.884386
H  -3.779318 -3.814404 1.595521
H  5.519775 2.453254 -1.114252
H  -4.177973 4.547185 -0.527406
H  -3.3022 -4.992044 -0.582518
H  3.003877 -2.291269 -1.517183
