program: Gaussian 09
title: 000272851
version: EM64L-G09RevD.01
frameworkgroup: C1[X(C21H18N2O4S)]
method: RPBEPBE
basis: SDD
operation: Freq
keyword: #p
keyword: freq=noraman
keyword: PBEPBE/SDD
title: #p freq=noraman PBEPBE/SDD
converged: YES YES NO NO
title: Mulliken charges:
elementType: S O O O O N N C C C C C C C C C C C C C C C C C C C C C H H H H H H H H H H H H H H H H H H
charge: 0.227094 -0.168002 -0.234589 -0.195484 -0.211937 -0.093094 -0.278488 -0.441846 0.241590 0.111629 -0.367850 0.559348 -0.769116 -0.670742 0.257245 0.268453 -0.348984 -0.418120 -0.326762 -0.240498 -0.224867 0.423034 -0.237489 -0.364556 -0.369560 -0.228206 -0.219154 -0.236062 0.241733 0.264402 0.245963 0.241016 0.282672 0.310536 0.270206 0.261296 0.253791 0.285803 0.231185 0.228330 0.230879 0.248150 0.266973 0.230820 0.231248 0.232005
chargesum: 0.00000
title: Mulliken charges with hydrogens summed into heavy atoms:
elementType: S O O O O N N C C C C C C C C C C C C C C C C C C C C C
charge: 0.227094 -0.168002 -0.234589 -0.195484 -0.211937 -0.093094 -0.278488 -0.441846 0.241590 0.111629 0.138285 0.559348 0.000535 -0.090000 0.257245 0.268453 -0.087688 -0.164329 -0.040958 -0.009312 0.003463 0.423034 -0.006610 -0.116406 -0.102586 0.002614 0.012094 -0.004057
polarizability: 3.06360368e+02 -2.80384355e+01 2.52508788e+02 1.80053084e+01 8.11251105e+00 2.01984474e+02
1716.lowfreq: -23.3246 -13.6120 -6.6559 -4.2858 -0.0021 -0.0019 -0.0016 17.3755 26.3764
frequency: -22.7801 17.3331 26.2461 33.8069 50.8106 70.9084 76.0756 85.8498 116.7699 135.4852 149.3371 164.7253 189.2052 200.5634 212.9685 218.5933 228.7439 235.4565 252.9968 256.2944 273.7244 298.8218 326.2940 350.0865 378.1239 386.8652 399.9661 400.8357 442.4891 465.7167 495.4518 504.1318 519.0358 535.8031 612.4714 613.7057 615.4072 620.0929 637.0421 638.6599 654.1984 658.3160 687.0505 700.8004 703.1046 709.4228 727.3919 749.9424 755.4306 771.2225 807.0854 834.8882 835.6610 855.0866 856.9981 865.2239 903.9163 927.9076 930.8081 935.2890 951.7574 969.9993 979.0971 980.9724 981.6659 988.6854 989.8605 990.5939 998.3809 999.2474 1001.6484 1028.4914 1029.9377 1060.6887 1083.5324 1087.1180 1097.7081 1116.2646 1145.5166 1146.4460 1173.1421 1174.5201 1190.7987 1191.2007 1204.9121 1207.3685 1225.1510 1233.4438 1258.0935 1271.5175 1278.7192 1288.8141 1307.5832 1318.8388 1327.4881 1330.6765 1378.9568 1384.2670 1396.0808 1434.9302 1437.7306 1439.4928 1457.9376 1461.6476 1476.8173 1483.2802 1483.4982 1590.0532 1595.3725 1612.2143 1613.7177 1657.7041 1729.0814 1740.2201 3006.8315 3011.3565 3027.2044 3050.2756 3096.2790 3101.6152 3125.3541 3128.4416 3129.4470 3130.5792 3136.6304 3137.4910 3142.1511 3149.4588 3152.0238 3162.6531 3166.3481 3174.4394
redmass: 3.8597 6.3804 4.9016 4.4748 7.5608 6.0617 7.4839 6.6199 4.9751 8.4367 4.7836 7.4235 1.7661 2.5436 6.5965 5.4854 2.9366 2.7501 4.2127 4.0983 4.3778 5.9204 6.7295 5.0238 6.4044 8.3594 2.8352 2.8583 7.9973 4.0153 5.9758 4.2704 6.1137 4.9194 6.7607 6.5774 9.4760 6.5034 4.8358 4.9739 5.4112 6.6661 7.1258 2.7566 2.1828 2.9969 2.6294 2.5702 2.1655 3.3975 3.8471 3.3650 3.9089 1.2499 1.2550 2.4396 3.8908 1.7350 1.7078 2.0744 4.3377 6.1564 3.1355 1.4987 1.5023 3.8759 4.4853 3.1064 1.6824 1.4478 1.8491 2.0568 2.1039 1.9077 1.8435 1.5991 2.4095 2.8857 2.1286 2.3458 1.0545 1.0531 1.1160 1.1171 1.8344 2.5547 1.7933 2.2617 1.7449 1.7465 3.9285 1.9418 6.8636 1.3410 1.2829 1.3057 7.6534 8.3318 1.1924 2.2392 2.0879 1.1218 1.0877 1.0536 1.0703 2.2070 2.2802 6.1620 6.2573 5.9792 6.0051 12.0401 12.5181 12.1867 1.0367 1.0834 1.0594 1.0565 1.1058 1.0992 1.0851 1.0851 1.0977 1.0900 1.1107 1.0889 1.0920 1.0938 1.0961 1.0975 1.1015 1.0986
irintensity: 0.1296 0.6230 0.2224 0.2042 1.0149 0.1852 1.2021 1.2256 3.1445 1.4131 2.9664 1.9426 2.4651 3.1113 0.3717 0.3349 0.8780 1.0645 1.2901 2.6690 1.9251 3.4226 1.4231 8.1202 13.4444 25.1467 0.2164 0.2583 2.4924 10.1405 3.1081 9.4804 14.7706 12.7439 0.4209 0.7202 8.0552 11.9529 7.2908 3.4223 15.0641 6.7591 15.0034 22.6535 9.0032 73.6055 46.6236 7.5414 64.2775 24.9162 9.6433 11.1794 2.2303 0.9040 0.5631 20.5352 6.0390 0.9523 9.4075 2.6358 5.3038 23.8896 148.9805 15.0785 19.0300 4.8271 5.4402 11.1269 9.1115 1.8591 13.2382 6.9790 5.7410 33.2152 47.4629 10.4686 66.9905 43.9750 4.5900 13.6284 0.2853 0.1053 5.2802 0.9022 7.3409 7.3636 4.1099 7.8576 26.8635 22.9905 50.0829 37.5485 376.7936 1.6196 7.1739 27.8728 0.5728 0.3671 25.4467 11.5425 18.3393 4.5273 17.1635 17.3727 16.0496 18.4870 15.9248 1.5207 0.3369 2.7853 5.4269 373.0644 281.9623 290.7942 10.1212 4.6353 28.1129 18.7720 4.1739 15.8614 2.1479 0.3148 2.1610 0.8004 5.8473 6.1931 13.0974 22.0289 23.2289 22.0432 25.7848 8.1666
temp: 298.150 k
press: 1.00000 atm
elementType: 16 8 8 8 8 7 7 6 6 6 6 6 6 6 6 6 6 6 6 6 6 6 6 6 6 6 6 6 1 1 1 1 1 1 1 1 1 1 1 1 1 1 1 1 1 1
symmnumber: 1
zpe: 909868.3 jmol-1
zpe.correction: 0.346551 hartree
zpe.thermalcorrener: 0.369876 hartree
zpe.thermalcorrenthalpy: 0.370821 hartree
zpe.thermalcorrgfe: 0.292772 hartree
zpe.sumelectzpe: -1617.521715 hartree
zpe.sumelectthermal: -1617.498389 hartree
zpe.sumelectthermalent: -1617.497445 hartree
zpe.sumelectthermalfe: -1617.575494 hartree
dipole: -0.0651 0.9114 -2.8584
dipole: 3.0009
quadrupole: -146.2310 -175.3013 -168.7418
quadrupole: -3.1989 0.2746 -6.2899
quadrupole: 17.1937 -11.8766 -5.3171 -3.1989 0.2746 -6.2899
hfenergy: -1617.8682658 hartree
pointgroup: C01 [X(C21H18N2O4S1)]
dipole: -0.0104141 -0.1609467 1.1695599 debye
polarizability: 307.8973709|21.5912872|251.2624701|-24.7086366|-0.0251851|201.6937894 unknown
InChI: InChI=1S/C21H18N2O4S/c1-20(23-17(24)16(27-19(23)26)14-8-4-2-5-9-14)18(25)22-12-13-28-21(20,22)15-10-6-3-7-11-15/h2-11,16H,12-13H2,1H3
charge 0 multiplicity 1
46 atoms
S  0.408446 0.057629 1.70033
O  0.786224 -3.211864 -1.521216
O  -1.908399 1.530276 -1.767702
O  -1.621582 -1.805798 -0.443459
O  0.315736 2.189931 -1.965729
N  1.649074 -1.97341 0.386133
N  -0.293654 -0.054395 -1.368374
C  1.64552 -0.490511 0.305786
C  1.052125 -0.626062 -1.195583
C  1.044916 -2.182641 -0.881901
C  1.305345 -2.581256 1.67907
C  2.967071 0.223855 0.472712
C  1.99124 -0.282414 -2.359295
C  0.111155 -1.750137 2.234604
C  -1.494045 -0.679585 -0.967002
C  -0.519128 1.306256 -1.731814
C  3.035027 1.630694 0.301396
C  4.147777 -0.496669 0.775599
C  -2.627742 0.305836 -1.326505
C  4.26479 2.305145 0.450155
C  5.378681 0.181296 0.925051
C  -3.593631 0.595556 -0.188212
C  5.44104 1.58408 0.766564
C  -4.491966 -0.423301 0.215314
C  -3.601655 1.847281 0.46984
C  -5.390251 -0.189745 1.279116
C  -4.507097 2.077035 1.530446
C  -5.401139 1.061522 1.938991
H  2.170144 -2.533984 2.362711
H  1.022761 -3.635388 1.519881
H  2.971524 -0.756547 -2.188088
H  1.569976 -0.688355 -3.295912
H  2.140863 0.801763 -2.467136
H  -0.842188 -2.081844 1.798028
H  0.074051 -1.762802 3.334974
H  2.131388 2.196225 0.044488
H  4.101161 -1.586429 0.877033
H  -3.167165 -0.091743 -2.207302
H  4.306981 3.391482 0.315004
H  6.28653 -0.38517 1.161102
H  6.395032 2.110278 0.882492
H  -4.480347 -1.396586 -0.288042
H  -2.915801 2.63442 0.143646
H  -6.081632 -0.980943 1.588886
H  -4.513467 3.049371 2.035082
H  -6.101984 1.243445 2.76124
