program: Gaussian 09
title: 000272836
version: EM64L-G09RevD.01
frameworkgroup: C1[X(C18H14N2O4)]
method: RPBEPBE
basis: SDD
operation: Freq
keyword: #p
keyword: freq=noraman
keyword: PBEPBE/SDD
title: #p freq=noraman PBEPBE/SDD
converged: YES YES NO NO
title: Mulliken charges:
elementType: O O O O N N C C C C C C C C C C C C C C C C C C H H H H H H H H H H H H H H
charge: -0.261453 -0.186518 -0.221431 -0.117806 -0.214804 -0.454563 -0.584748 0.456243 0.102927 0.228571 -0.404048 0.469220 0.099797 0.484724 -0.397017 -0.372593 -0.442837 -0.340138 -0.240796 -0.223367 -0.239653 -0.195855 -0.212636 -0.249126 0.253905 0.300066 0.228462 0.311020 0.222238 0.285107 0.219764 0.307413 0.229121 0.231156 0.232538 0.230904 0.232499 0.233716
chargesum: 0.00000
title: Mulliken charges with hydrogens summed into heavy atoms:
elementType: O O O O N N C C C C C C C C C C C C C C C C C C
charge: -0.261453 -0.186518 -0.221431 -0.117806 -0.214804 -0.143544 -0.030777 0.456243 0.102927 0.228571 -0.175586 0.469220 0.099797 0.484724 -0.174779 -0.087487 -0.223073 -0.032725 -0.011675 0.007789 -0.007115 0.035049 0.019863 -0.015410
polarizability: 2.77908530e+02 1.35643290e+00 3.27660534e+02 -2.62250535e+01 7.61057054e+00 1.53991176e+02
1716.lowfreq: -7.2496 -2.8439 -0.2108 0.0004 0.0007 0.0008 5.2588 22.2919 28.8122
frequency: 4.5098 22.1980 28.8025 47.4903 61.3269 70.0903 77.7236 97.1772 105.8010 144.8965 163.9974 214.8315 219.0935 248.9238 271.0614 276.6929 317.1858 333.7750 340.3864 354.0633 404.2381 406.0578 460.2193 496.5101 513.6314 519.8437 559.8195 569.4558 601.9476 605.3727 613.2957 619.9956 628.8756 633.5624 678.2640 696.1823 696.5066 715.0725 729.6293 757.7376 767.4752 770.3057 824.6206 831.6691 841.7042 843.0784 862.5282 885.5778 913.9174 920.8749 928.5597 933.1515 975.6776 982.2266 985.3978 987.3912 1002.7638 1002.8715 1024.9812 1027.7433 1036.3535 1050.6778 1090.3723 1091.0997 1153.7861 1165.4513 1174.6643 1175.3697 1190.6388 1199.9012 1237.8625 1254.2061 1302.3716 1315.6449 1327.8239 1339.3933 1355.7263 1378.4592 1385.4375 1391.1775 1429.9778 1439.8343 1448.4435 1484.2872 1486.5698 1516.3845 1577.3717 1604.0206 1608.9424 1614.1230 1641.1775 1652.2255 1673.0192 1739.1264 2981.3427 3041.8088 3108.7127 3117.2715 3124.8057 3132.8522 3136.4765 3146.3325 3148.6597 3163.9444 3168.3547 3186.9858 3197.9047 3508.5933
redmass: 6.0028 4.4043 4.7852 5.2638 7.6858 5.4769 8.2058 6.6467 6.7264 6.5861 9.0888 5.0624 4.3478 3.5330 5.1747 5.0903 5.1010 6.0495 7.5145 8.9947 2.8260 2.8968 9.4481 2.8698 3.4759 5.5353 4.0768 5.9210 6.8994 6.2852 6.4212 8.1366 7.1121 1.2072 7.2761 1.9713 1.7586 7.6150 8.9956 6.3248 1.7299 1.6841 5.6085 5.6503 1.3474 1.2696 1.3278 7.4608 6.9119 1.4300 3.0894 1.4934 1.3575 1.3810 6.1631 6.1648 1.3286 1.3172 2.5365 2.3022 3.7084 3.6712 1.6934 1.5600 2.5430 2.9383 1.0545 1.0795 1.1138 1.1239 1.9058 2.1079 1.6835 1.7332 1.5988 1.3668 1.7940 6.2190 6.9851 3.3576 2.3012 1.5096 1.4793 2.3230 2.3255 2.0507 5.6254 5.2520 5.8519 6.0018 7.1520 9.5206 8.4100 12.8890 1.0581 1.1026 1.0892 1.0878 1.0879 1.0873 1.0869 1.0934 1.0933 1.0992 1.0998 1.0955 1.0953 1.0762
irintensity: 0.2854 1.1017 0.1350 0.8161 1.0849 0.9350 1.4894 5.8351 0.9745 0.4877 0.1112 4.5245 2.9277 1.4453 2.3974 4.9699 3.9326 0.7721 0.5252 8.9443 0.0013 0.0205 6.8854 20.7355 13.0627 33.0076 1.2991 19.1168 0.0820 3.9888 0.5431 0.7031 7.4693 36.4361 5.0575 50.8894 45.1145 4.8693 4.8083 13.7310 26.4474 89.7620 2.3868 7.5597 23.2423 0.6497 17.3738 86.0959 10.7485 12.3430 7.9974 13.1022 0.2260 0.0188 0.0431 0.7122 1.2285 1.5442 8.1251 0.7575 20.3521 19.6361 6.5672 15.9621 13.9691 78.8072 0.9146 2.7036 2.1587 6.0366 23.5871 36.4186 7.7572 81.5625 9.4011 10.1124 32.2031 74.3984 55.3434 28.4387 90.2955 34.4709 23.7075 62.3142 3.6434 309.3216 1.8132 41.3964 1.5778 45.1528 206.0964 348.9335 9.6085 758.1507 31.4518 6.8764 15.0685 5.2988 25.2935 0.5167 0.4119 29.6543 25.1713 35.6232 21.7475 6.4412 5.9197 15.1592
temp: 298.150 k
press: 1.00000 atm
elementType: 8 8 8 8 7 7 6 6 6 6 6 6 6 6 6 6 6 6 6 6 6 6 6 6 1 1 1 1 1 1 1 1 1 1 1 1 1 1
symmnumber: 1
zpe: 743567.2 jmol-1
zpe.correction: 0.283210 hartree
zpe.thermalcorrener: 0.303559 hartree
zpe.thermalcorrenthalpy: 0.304504 hartree
zpe.thermalcorrgfe: 0.229549 hartree
zpe.sumelectzpe: -1103.048285 hartree
zpe.sumelectthermal: -1103.027936 hartree
zpe.sumelectthermalent: -1103.026991 hartree
zpe.sumelectthermalfe: -1103.101946 hartree
dipole: 4.4038 -5.9083 -4.9606
dipole: 8.8830
quadrupole: -126.8004 -156.9774 -131.2006
quadrupole: 10.6977 -5.3341 -7.1836
quadrupole: 11.5257 -18.6513 7.1256 10.6977 -5.3341 -7.1836
hfenergy: -1103.331495 hartree
pointgroup: C01 [X(C18H14N2O4)]
dipole: -1.5390644 2.7865195 -1.4424166 debye
polarizability: 279.6725804|1.7755736|324.9433026|23.3667946|21.1176685|154.9443575 unknown
InChI: InChI=1S/C18H14N2O4/c21-15(19-14-9-5-2-6-10-14)12-20-16(24-18(23)17(20)22)11-13-7-3-1-4-8-13/h1-11,19H,12H2
charge 0 multiplicity 1
38 atoms
O  2.741627 -1.769715 -0.166351
O  0.249201 -4.167831 -1.160607
O  -1.295675 -1.0113 0.825989
O  3.132583 -4.083262 0.032812
N  0.635675 -1.824454 -1.035338
N  -2.641637 -0.110246 -0.885182
C  -0.669247 -1.413608 -1.525732
C  1.668285 -0.961153 -0.605765
C  0.965191 -3.180299 -0.868043
C  -1.555406 -0.821704 -0.392378
C  1.677752 0.404603 -0.611974
C  2.73922 1.321726 -0.19396
C  2.374518 -3.170204 -0.289779
C  -3.700439 0.517459 -0.156762
C  2.478612 2.722533 -0.287645
C  4.013857 0.902035 0.296771
C  -4.714719 1.160935 -0.914985
C  -3.765352 0.519105 1.261314
C  3.448117 3.670892 0.091679
C  4.979359 1.855841 0.67408
C  4.706699 3.241674 0.574821
C  -5.786907 1.802387 -0.263343
C  -4.847036 1.166429 1.897431
C  -5.859432 1.809018 1.149269
H  -0.558394 -0.700982 -2.365577
H  -1.152047 -2.333677 -1.910518
H  0.751644 0.876225 -0.963776
H  -2.722307 -0.043242 -1.903847
H  1.503104 3.062862 -0.657894
H  4.237127 -0.163894 0.381851
H  -4.667017 1.158053 -2.012212
H  -2.984288 0.022691 1.839426
H  3.225008 4.740555 0.013437
H  5.951465 1.517645 1.04973
H  5.463692 3.97585 0.87143
H  -6.564081 2.294355 -0.858033
H  -4.894661 1.165012 2.991889
H  -6.692489 2.306287 1.65677
