program: Gaussian 09
title: 000272835
version: EM64L-G09RevD.01
frameworkgroup: C1[X(C18H13NO4)]
method: RPBEPBE
basis: SDD
operation: Freq
keyword: #p
keyword: freq=noraman
keyword: PBEPBE/SDD
title: #p freq=noraman PBEPBE/SDD
converged: YES YES NO NO
title: Mulliken charges:
elementType: O O O O N C C C C C C C C C C C C C C C C C C H H H H H H H H H H H H H
charge: -0.242678 -0.441038 -0.253432 -0.245416 -0.015901 0.313669 -0.225557 0.165687 0.063157 0.263074 -0.375130 -0.374405 0.329315 -0.390330 -0.244247 -0.374496 -0.369223 0.118991 0.120382 -0.247163 -0.228749 -0.237381 -0.505482 0.275633 0.303450 0.269290 0.239001 0.222453 0.289212 0.228072 0.227596 0.231237 0.391073 0.243922 0.231939 0.243476
chargesum: 0.00000
title: Mulliken charges with hydrogens summed into heavy atoms:
elementType: O O O O N C C C C C C C C C C C C C C C C C C
charge: -0.242678 -0.049965 -0.253432 -0.245416 -0.015901 0.313669 -0.225557 0.165687 0.063157 0.263074 -0.099498 -0.070955 0.329315 -0.121040 -0.005247 -0.152044 -0.080011 0.118991 0.120382 -0.019091 -0.001153 -0.006144 0.213855
polarizability: 3.52130411e+02 -4.92119634e+00 2.70417117e+02 5.64727640e+00 -2.22523315e+00 9.32408389e+01
1716.lowfreq: -5.6967 -3.6681 -0.0010 -0.0008 -0.0004 1.5232 26.2428 30.4649 37.1872
frequency: 26.1982 30.4631 37.1821 45.2275 63.4385 70.2055 101.0893 118.6080 127.0631 169.1721 171.5016 190.9465 213.1129 255.8460 275.6614 289.1996 307.3752 336.1507 361.2002 375.5932 402.1779 419.3560 455.2784 469.7837 523.8472 550.5366 562.5821 573.5235 609.0935 610.2649 612.0950 619.1395 675.2342 689.5178 697.6917 719.1396 731.6005 752.8029 785.5099 787.8228 816.9103 837.9525 848.4186 855.3253 864.3746 916.8734 936.5311 940.8625 955.3080 987.1726 989.2578 997.6174 1009.2033 1009.4570 1023.3595 1057.9279 1076.1462 1080.9213 1095.9159 1108.1965 1141.0829 1148.9025 1172.8639 1189.8945 1195.1295 1220.5255 1264.1123 1275.7052 1288.9106 1314.9375 1335.2308 1343.4810 1368.0266 1386.4884 1413.9814 1420.0811 1430.3805 1450.5362 1451.3946 1462.2312 1482.6841 1505.0766 1545.6150 1580.7666 1587.7553 1597.9267 1607.8990 1614.1695 1636.9503 3002.2963 3103.3203 3126.3861 3135.1017 3145.3011 3147.6780 3148.2790 3159.5046 3164.4629 3169.2445 3187.4855 3199.2155 3531.5691
redmass: 3.8536 5.4380 8.8011 7.3599 4.8648 5.3890 3.2339 1.4930 2.7878 5.3499 5.8145 4.5033 6.0691 4.7685 6.2179 7.2334 4.9287 6.8836 5.5770 8.6720 2.8222 5.7526 4.6809 3.8809 5.3188 3.3619 5.8412 3.7707 2.2189 5.4250 3.0043 5.9185 4.7850 5.2298 1.7254 5.2659 5.8155 6.2216 1.8256 2.0874 6.8478 5.5313 2.9417 1.2861 6.8722 7.1698 1.4492 1.5731 1.4283 1.7547 3.0980 5.4136 1.3560 1.3644 2.5972 2.7993 3.6947 1.6858 1.9013 1.2656 2.1311 1.5333 1.0582 1.1620 1.2929 2.0132 2.7484 2.6088 2.0404 1.9819 2.7457 4.3681 4.7824 7.9268 1.8660 1.6092 2.5964 2.6631 1.0816 1.0562 2.7394 3.7110 7.1319 7.3199 6.1487 7.1494 7.6421 6.3758 8.4173 1.0294 1.1044 1.0848 1.0882 1.0880 1.0934 1.1046 1.0959 1.0947 1.1003 1.0959 1.0912 1.0642
irintensity: 0.0351 0.5659 0.3142 1.7534 0.0974 2.2441 3.4606 0.6242 2.1935 3.1447 1.7368 2.0794 0.7578 3.5813 0.6499 1.5540 3.1846 9.2812 3.0188 1.6874 0.1975 7.5463 0.6564 11.6938 2.7378 14.1360 12.8414 17.5045 79.9863 58.1005 40.7532 20.3014 13.0935 6.0437 52.0517 8.6116 2.8297 29.6022 53.9542 28.1075 8.2315 6.5268 19.4569 0.1803 2.8476 25.0981 16.1819 0.4045 0.5817 0.5503 0.2208 110.2815 2.5296 4.1743 10.7799 56.8418 286.4110 21.1850 61.9360 0.0408 38.0914 36.2730 1.0880 12.6833 39.2467 26.7912 77.4903 31.1387 36.4394 20.6941 20.6840 104.0033 5.1428 1.6608 2.8796 13.3307 32.0681 9.0628 12.4289 6.8761 16.8634 14.6336 126.4569 87.1387 29.1595 102.1069 121.3787 15.1245 176.2157 33.6154 24.6626 1.8164 6.0178 6.9273 27.1469 14.5064 16.9880 8.7262 30.3155 12.6315 0.2498 60.9093
temp: 298.150 k
press: 1.00000 atm
elementType: 8 8 8 8 7 6 6 6 6 6 6 6 6 6 6 6 6 6 6 6 6 6 6 1 1 1 1 1 1 1 1 1 1 1 1 1
symmnumber: 1
zpe: 699053.1 jmol-1
zpe.correction: 0.266255 hartree
zpe.thermalcorrener: 0.285867 hartree
zpe.thermalcorrenthalpy: 0.286811 hartree
zpe.thermalcorrgfe: 0.215864 hartree
zpe.sumelectzpe: -1047.794296 hartree
zpe.sumelectthermal: -1047.774685 hartree
zpe.sumelectthermalent: -1047.773741 hartree
zpe.sumelectthermalfe: -1047.844688 hartree
dipole: 2.1369 -1.8396 1.3552
dipole: 3.1284
quadrupole: -117.3223 -115.0435 -138.2941
quadrupole: 1.8488 -1.7698 7.9342
quadrupole: 6.2310 8.5098 -14.7408 1.8488 -1.7698 7.9342
hfenergy: -1048.0605515 hartree
pointgroup: C01 [X(C18H13N1O4)]
dipole: -1.0043049 0.4212381 0.57346 debye
polarizability: 345.2955919|20.965339|275.9874124|-18.5645277|-4.4432881|94.5053634 unknown
InChI: InChI=1S/C18H13NO4/c1-23-18(22)13-9-5-8-12-14(17(20)21)10-15(19-16(12)13)11-6-3-2-4-7-11/h2-10,20H,1H3
charge 0 multiplicity 1
36 atoms
O  1.532244 -2.880788 0.7090
O  -0.701239 4.366667 0.181651
O  1.599222 4.455167 0.005894
O  3.057107 -3.17625 -1.019981
N  0.111885 -0.557861 -0.160933
C  1.623813 1.420803 -0.169558
C  1.378973 -0.015908 -0.19034
C  0.454605 2.265839 -0.027824
C  -0.965599 0.254697 -0.048047
C  2.502582 -0.915608 -0.306414
C  -0.813439 1.677902 0.0450
C  2.965176 1.903575 -0.300371
C  -2.305114 -0.398123 -0.013865
C  3.79414 -0.398024 -0.475275
C  4.023839 1.006449 -0.465884
C  -3.51265 0.341714 -0.141403
C  -2.38235 -1.809326 0.149871
C  0.557656 3.755628 0.047865
C  2.384115 -2.410389 -0.284523
C  -4.762711 -0.311794 -0.102675
C  -3.631147 -2.459522 0.190609
C  -4.828516 -1.714097 0.065749
C  1.421713 -4.357815 0.794194
H  -1.681457 2.324524 0.175772
H  3.143986 2.980248 -0.278808
H  4.627325 -1.095709 -0.607492
H  5.044246 1.385573 -0.583058
H  -3.490952 1.426599 -0.289452
H  -1.443097 -2.363449 0.242213
H  -5.684012 0.271566 -0.208138
H  -3.675582 -3.546595 0.320859
H  -5.799996 -2.219878 0.097241
H  -0.568255 5.351191 0.230929
H  1.014507 -4.764041 -0.147034
H  0.737772 -4.535519 1.635759
H  2.411607 -4.807348 0.981569
