program: Gaussian 09
title: 000272867
version: EM64L-G09RevD.01
frameworkgroup: C1[X(C24H20N2O7)]
method: RPBEPBE
basis: SDD
operation: Freq
keyword: #p
keyword: freq=noraman
keyword: PBEPBE/SDD
title: #p freq=noraman PBEPBE/SDD
converged: YES YES NO NO
title: Mulliken charges:
elementType: O O O O O O O N N C C C C C C C C C C C C C C C C C C C C C C C C H H H H H H H H H H H H H H H H H H H H
charge: -0.268523 -0.210786 -0.192754 -0.214552 -0.181821 -0.196224 -0.213416 -0.268326 -0.219994 -0.120900 -0.413124 -0.387738 -0.518798 0.068788 0.129485 0.196377 0.239282 0.211216 0.244235 -0.496507 -0.364974 -0.373093 0.175728 0.184929 0.103341 0.146658 -0.216510 -0.213355 -0.352541 -0.339316 -0.208121 -0.213158 -0.497185 0.262022 0.279104 0.236869 0.239276 0.224663 0.218491 0.237745 0.279277 0.259298 0.267704 0.264786 0.235994 0.234894 0.269914 0.266280 0.239388 0.238065 0.251141 0.234107 0.242660
chargesum: 0.00000
title: Mulliken charges with hydrogens summed into heavy atoms:
elementType: O O O O O O O N N C C C C C C C C C C C C C C C C C C C C C C C C
charge: -0.268523 -0.210786 -0.192754 -0.214552 -0.181821 -0.196224 -0.213416 -0.268326 -0.219994 0.141122 0.102849 0.076201 -0.062561 0.068788 0.129485 0.196377 0.239282 0.211216 0.244235 0.042067 -0.097270 -0.108308 0.175728 0.184929 0.103341 0.146658 0.019484 0.021538 -0.082627 -0.073036 0.031268 0.024907 0.230723
polarizability: 2.99462285e+02 2.76026801e+01 3.21009083e+02 3.81737363e+01 1.52945096e+01 2.44958427e+02
1716.lowfreq: -5.9721 -2.3893 -0.0006 -0.0003 0.0004 4.4163 5.8434 16.7695 18.2612
frequency: 5.3296 16.6762 18.1994 27.6046 34.4626 40.7130 48.1079 58.0071 65.5328 77.7288 92.5091 107.9154 122.0876 131.5654 139.2554 144.5864 156.6099 161.8660 180.9390 182.9798 191.2143 227.7222 236.3693 241.4366 255.8216 267.4796 305.1995 308.8935 323.0741 335.6325 348.4340 358.3389 369.8380 413.4320 413.9243 454.9073 456.0448 460.4627 480.6284 522.1267 523.4355 533.2393 554.0357 568.9922 594.9388 619.0864 631.8701 657.9404 658.7619 682.4680 683.9631 695.1016 703.2509 712.4898 715.3826 732.6341 766.8876 784.8402 790.3720 793.6352 796.6063 812.5340 826.6227 838.8577 869.3855 885.7661 901.2329 905.2448 906.6829 932.6925 962.7116 972.5092 974.4532 975.1100 992.0739 1004.2098 1005.6883 1013.7692 1016.0609 1028.5123 1039.2239 1062.1414 1072.2609 1074.4323 1085.3368 1097.4879 1115.1737 1128.9164 1150.6508 1166.9616 1169.0220 1170.8431 1172.7925 1174.8359 1193.0465 1207.5281 1209.9228 1217.6371 1270.1724 1280.0884 1283.6712 1284.7002 1295.5256 1311.7764 1318.3862 1330.3184 1339.5614 1346.7177 1364.2943 1367.1502 1415.8151 1416.0079 1421.5432 1426.5996 1452.4019 1454.3681 1454.7070 1455.1235 1455.7972 1458.7232 1463.9826 1465.0928 1480.8462 1614.7043 1616.3120 1619.2743 1622.2559 1627.4115 1631.7174 1644.1518 1645.6577 1680.6296 1682.6059 2963.5513 2981.6842 2995.9817 3001.0034 3007.9001 3026.5608 3037.9173 3066.6363 3071.8259 3092.5177 3112.5955 3134.5632 3140.1091 3148.1895 3153.1159 3153.9644 3159.7967 3165.6633 3171.3313 3175.3278
redmass: 6.0216 6.9802 7.6231 6.7718 6.3258 5.8789 5.9345 7.7009 7.5314 5.0842 3.2047 1.2686 5.4306 7.5353 5.1190 5.0699 3.6849 3.6598 5.5719 6.4281 4.2765 5.0845 5.0362 6.5744 4.2691 2.7956 3.8623 3.9637 8.2684 8.4235 7.0513 3.9052 7.0093 3.2178 3.3592 4.8659 4.8828 4.3574 3.8406 6.7157 7.0589 6.1147 2.8353 7.0702 6.8871 4.5524 5.2261 4.8142 4.8112 7.0499 6.6001 5.0216 4.4652 3.0173 3.4713 4.2197 1.7409 5.2395 4.5644 1.7115 1.7687 2.5229 6.8014 4.5787 3.5302 3.5519 3.9167 1.4053 1.4246 3.3825 4.7122 1.4178 1.4124 4.7592 2.8145 1.3454 1.3489 2.1803 2.0659 2.2766 3.0254 2.3158 2.6365 2.6119 4.0734 3.0291 1.2692 2.6155 1.4558 1.2727 1.2311 1.7506 1.9951 2.0024 2.3283 1.7439 2.8986 2.4324 1.2913 1.3567 1.4730 1.4410 1.3953 1.1970 1.3047 1.5682 1.7247 4.0836 1.6258 4.2321 4.4312 6.0430 1.1789 1.2162 1.0505 2.6568 2.5070 2.5788 2.7802 1.1212 1.0517 1.0804 1.0914 7.6638 7.7817 8.2994 8.1159 10.8252 11.6022 9.0909 10.6980 11.8822 12.2339 1.0805 1.0597 1.0605 1.0598 1.0292 1.0605 1.1016 1.1009 1.1021 1.1038 1.1049 1.0862 1.0864 1.0905 1.1053 1.0906 1.0956 1.0956 1.1001 1.1003
irintensity: 0.0868 0.1554 0.3051 1.3129 0.8608 3.6836 2.1012 1.6911 0.5019 3.2046 1.3697 0.5028 3.2807 1.4791 0.2089 0.0147 3.0886 0.9668 1.5112 1.9326 8.6816 1.9626 0.9706 0.3311 5.8075 3.1503 5.2248 10.2341 5.6509 20.7946 2.6851 3.8658 8.6155 3.6982 4.2519 0.1938 0.3374 3.1284 22.4106 9.7194 9.6503 10.7397 0.4587 2.1956 14.2892 6.7069 7.4590 0.0197 0.7175 0.8221 2.2447 1.7479 25.1526 69.8576 29.0405 64.7526 44.4165 0.1073 0.6526 14.0840 26.6674 13.5981 7.0008 6.5725 11.5539 13.0738 8.4132 0.6523 0.3229 22.0071 49.3712 2.6749 1.6657 27.8214 32.7739 0.0824 0.1274 2.1117 2.7838 13.7249 56.0583 30.4405 13.5640 7.0035 9.5338 10.3060 1.9007 239.9072 16.4611 10.0673 17.8101 17.7951 4.4910 80.7455 78.8282 12.6490 47.5870 73.4256 31.3509 5.7320 1.9634 0.5957 16.0763 7.3415 3.2931 25.0120 40.7037 294.0111 31.5106 238.9313 1.7887 9.5141 17.1736 55.9461 14.2902 6.6376 13.0048 5.3634 0.8131 11.2879 12.1837 3.6309 18.2435 0.3754 0.9756 189.1699 94.0283 493.5291 177.6362 102.2559 192.1311 43.2828 46.8673 17.7704 16.4978 17.9618 31.0757 34.8942 5.3514 19.1740 1.9859 19.1386 20.3974 20.6759 1.2618 1.5957 6.2384 14.6983 4.9673 10.8498 6.4127 22.1130 20.2276
temp: 298.150 k
press: 1.00000 atm
elementType: 8 8 8 8 8 8 8 7 7 6 6 6 6 6 6 6 6 6 6 6 6 6 6 6 6 6 6 6 6 6 6 6 6 1 1 1 1 1 1 1 1 1 1 1 1 1 1 1 1 1 1 1 1
symmnumber: 1
zpe: 1041195.2 jmol-1
zpe.correction: 0.396570 hartree
zpe.thermalcorrener: 0.426299 hartree
zpe.thermalcorrenthalpy: 0.427243 hartree
zpe.thermalcorrgfe: 0.330694 hartree
zpe.sumelectzpe: -1560.348372 hartree
zpe.sumelectthermal: -1560.318644 hartree
zpe.sumelectthermalent: -1560.317699 hartree
zpe.sumelectthermalfe: -1560.414248 hartree
dipole: 1.9638 2.4852 -0.7016
dipole: 3.2442
quadrupole: -180.9795 -166.2713 -186.2862
quadrupole: 31.7256 1.9595 6.1530
quadrupole: -3.1338 11.5744 -8.4405 31.7256 1.9595 6.1530
hfenergy: -1560.7449424 hartree
pointgroup: C01 [X(C24H20N2O7)]
dipole: 0.5331821 1.1315773 -0.2537529 debye
polarizability: 298.3058345|21.9676879|326.5027198|29.4800843|26.8604066|240.6212408 unknown
InChI: InChI=1S/C24H20N2O7/c1-33-24(32)19(26-22(30)17-10-4-5-11-18(17)23(26)31)12-6-7-14(27)13-25-20(28)15-8-2-3-9-16(15)21(25)29/h2-5,8-11,19H,6-7,12-13H2,1H3
charge 0 multiplicity 1
53 atoms
O  -3.685675 -3.222421 1.712228
O  -3.715937 0.293785 -1.977749
O  -1.251604 0.012165 2.024158
O  -4.289992 -1.000301 2.041876
O  1.731317 -2.915476 0.001671
O  5.018891 -1.475367 -1.623616
O  0.865797 0.510806 -0.667604
N  -2.531667 -0.188444 0.025594
N  2.789775 -0.693116 -1.352937
C  -2.86101 -1.615253 0.104084
C  -1.625913 -2.533236 -0.092635
C  -1.139977 -2.510016 -1.557814
C  0.130157 -3.393214 -1.786122
C  -3.02019 0.670154 -1.000232
C  -1.782623 0.525564 1.01225
C  -2.532052 2.03859 -0.645036
C  -1.799045 1.953223 0.562105
C  -3.666809 -1.867602 1.395945
C  1.350203 -2.720931 -1.178291
C  2.095291 -1.725215 -2.104173
C  -2.714488 3.261273 -1.308102
C  -1.229863 3.090435 1.151236
C  4.425401 0.479692 -0.187931
C  3.174329 1.082463 0.09597
C  4.198459 -0.674295 -1.115889
C  2.109201 0.32942 -0.636097
C  -2.139824 4.418081 -0.721409
C  -1.410493 4.333961 0.492241
C  5.615631 0.96864 0.369503
C  3.072879 2.193137 0.945724
C  5.523406 2.09221 1.232282
C  4.271783 2.695097 1.515741
C  -4.485042 -3.583862 2.91054
H  -3.570958 -1.791399 -0.733803
H  -0.824898 -2.219589 0.598766
H  -1.916195 -3.559824 0.190286
H  -0.93231 -1.468202 -1.870114
H  -1.942367 -2.888567 -2.220639
H  0.280034 -3.536262 -2.873513
H  -0.013978 -4.381436 -1.313626
H  2.854354 -2.290043 -2.680784
H  1.385089 -1.268531 -2.815959
H  -3.284467 3.313542 -2.240994
H  -0.677126 3.013083 2.093288
H  -2.263645 5.391759 -1.207632
H  -0.985573 5.245715 0.926324
H  6.575922 0.49361 0.146326
H  2.099896 2.646192 1.159744
H  6.43131 2.499803 1.689489
H  4.232496 3.558676 2.188201
H  -4.0761 -3.077544 3.800243
H  -4.387692 -4.675147 2.992132
H  -5.536807 -3.283184 2.770558
