program: Gaussian 09
title: 000272871
version: EM64L-G09RevD.01
frameworkgroup: C1[X(C25H22ClNO4)]
method: RPBEPBE
basis: SDD
operation: Freq
keyword: #p
keyword: freq=noraman
keyword: PBEPBE/SDD
title: #p freq=noraman PBEPBE/SDD
converged: YES YES NO NO
title: Mulliken charges:
elementType: Cl O O O O N C C C C C C C C C C C C C C C C C C C C C C C C C H H H H H H H H H H H H H H H H H H H H H H
charge: -0.068614 -0.237612 -0.224031 -0.276251 -0.216162 -0.366053 -0.164543 -0.579490 0.468998 0.215153 -0.388237 -0.400320 -0.420774 0.305914 0.293483 0.363621 0.122462 -0.227217 -0.229196 0.338395 -0.239695 -0.351634 -0.360901 -0.406378 -0.393025 -0.673722 -0.389218 -0.388092 -0.233896 -0.234807 -0.235322 0.299026 0.232670 0.241444 0.370240 0.258657 0.231105 0.262610 0.261550 0.221866 0.222671 0.239391 0.278902 0.224692 0.244917 0.246993 0.292853 0.290372 0.241410 0.239638 0.231020 0.230497 0.234640
chargesum: 0.00000
title: Mulliken charges with hydrogens summed into heavy atoms:
elementType: Cl O O O O N C C C C C C C C C C C C C C C C C C C C C C C C C
charge: -0.068614 -0.237612 -0.224031 -0.276251 -0.216162 0.004187 0.134483 -0.105376 0.468998 0.215153 -0.129580 -0.169215 0.103386 0.305914 0.293483 0.363621 0.122462 -0.005351 -0.006524 0.338395 -0.015003 -0.112243 -0.081999 -0.161462 -0.146032 -0.090497 -0.147808 -0.148454 -0.002876 -0.004310 -0.000682
polarizability: 4.54711059e+02 4.00726611e+01 2.16032596e+02 7.60132173e+00 2.89702351e+01 2.67755345e+02
1716.lowfreq: -9.7848 -4.0925 -0.7965 -0.0017 -0.0015 -0.0009 7.6358 8.2809 18.2349
frequency: -5.5641 7.9611 17.8614 21.7735 25.5026 28.2188 34.9956 48.2032 59.2467 66.1746 80.0592 84.8335 90.2320 99.7898 111.5767 135.4216 157.0289 172.4883 214.5071 225.0805 232.4121 280.1055 283.2114 310.8178 321.6252 351.4453 366.6845 378.3942 391.8057 402.4828 405.1557 407.6966 434.0911 461.3549 462.8442 492.6204 494.6525 527.2770 535.4954 560.9283 578.5807 613.2440 616.6258 618.1798 633.2132 635.4757 657.6092 674.9732 684.9720 700.8420 705.8564 717.0107 732.3012 738.6914 756.1445 772.5522 783.6232 791.6492 827.8845 838.6237 850.5512 856.4906 863.5833 908.2157 924.2332 925.3104 930.0841 944.1154 963.0302 964.9465 975.9040 978.2541 978.8153 987.8254 990.3220 992.8193 995.2793 995.7714 997.9102 1005.6161 1016.5429 1028.1354 1038.5456 1042.8817 1082.8285 1087.3599 1125.9750 1126.7833 1141.2084 1153.8374 1171.2992 1175.8481 1190.3196 1192.7016 1201.2000 1203.3332 1220.8898 1230.3947 1247.0844 1248.1486 1257.0477 1262.7752 1292.6115 1306.7764 1309.4223 1314.5219 1325.9419 1333.8339 1348.4418 1361.4691 1378.0903 1383.3452 1419.0542 1421.2612 1423.7174 1438.7145 1441.4315 1462.0530 1476.7831 1484.1096 1509.4767 1514.8241 1551.7678 1583.7612 1591.7210 1592.3726 1595.5907 1611.8638 1614.5088 1620.7629 1647.3292 2971.1320 3003.7299 3013.2444 3068.6666 3072.6538 3097.1261 3116.3895 3124.2537 3127.0269 3130.5616 3133.5799 3137.7105 3140.2704 3143.8626 3149.0216 3149.8133 3152.6586 3156.3807 3162.7938 3164.0921 3168.4615 3487.8859
redmass: 8.9346 6.3258 6.4079 4.8928 9.2074 6.5376 4.4789 7.0069 6.2407 4.4382 3.9306 5.5195 4.6718 4.5307 9.3380 5.2786 5.0602 5.3329 6.7720 5.0716 6.1650 5.2757 4.6177 3.9905 9.3971 6.9421 2.1282 6.0367 4.9607 2.8361 2.8416 2.8649 5.0088 4.1874 4.9560 4.4188 5.6089 3.1699 4.4041 3.6478 2.4119 6.5147 4.8934 4.9061 6.8864 5.9200 3.9282 2.4242 1.9275 1.7537 1.9127 3.5800 5.0921 3.1268 2.8999 1.9515 3.1983 5.2920 3.1342 1.4661 1.2515 1.2516 1.4030 1.7338 1.4841 1.4936 3.7583 3.1446 4.4076 1.4491 1.5245 2.9972 1.4936 3.4987 4.1179 2.0615 1.4494 6.3112 1.3232 1.7230 2.7662 2.2334 2.6750 2.2883 1.6679 1.6233 3.3219 1.4089 3.3646 1.1222 1.0550 1.0535 1.1484 1.1165 1.4388 1.1805 1.8647 1.1376 1.6921 2.1057 1.2025 1.6762 2.8532 1.4156 1.7125 1.5084 1.5020 1.2841 1.3705 2.7900 9.5786 7.2670 1.0918 3.9390 1.1183 2.3851 2.1651 1.1135 2.1476 2.2932 2.0738 2.7855 6.5313 6.4716 7.3561 6.3103 9.2986 6.0497 6.1034 6.4813 10.8755 1.0801 1.0610 1.0607 1.0566 1.1028 1.1003 1.0857 1.0873 1.0848 1.0875 1.0874 1.0924 1.0887 1.0915 1.1088 1.0958 1.0964 1.0956 1.1013 1.0968 1.1016 1.0791
irintensity: 0.6214 0.0993 0.4957 0.2416 0.2759 0.7053 0.8285 0.2978 0.0189 1.8266 6.1124 3.5300 1.3966 10.4549 0.2583 1.6227 4.1190 1.4498 3.1243 7.3059 3.1745 0.6110 15.2814 12.8216 5.4922 0.5413 9.7283 2.3087 7.5244 0.4496 0.2195 1.5900 8.7513 12.3104 13.1278 9.2438 23.3190 3.7180 6.4831 1.2989 9.9863 0.1255 8.4265 6.9113 0.3504 0.7711 2.1593 83.8058 146.6592 45.3897 65.9533 31.1884 13.6670 24.3783 12.7636 70.8632 0.7398 5.9879 20.3771 9.0687 0.7455 1.7601 19.8163 9.1493 4.4317 2.9292 21.9036 23.4840 16.8166 0.8665 4.3423 107.5830 5.2027 0.3925 0.0214 10.5321 0.5413 6.8566 0.1613 1.5480 19.6975 5.7211 10.7948 12.4469 40.7680 8.2267 19.9232 12.1597 433.2126 5.9714 0.6307 0.0418 1.5507 2.0724 13.9388 60.3313 10.9087 0.8994 58.3867 111.5561 24.8497 17.9224 5.8532 11.0337 13.9891 10.7570 52.5967 3.0519 11.9120 22.4815 1.2804 0.3803 41.0442 19.2156 39.2533 8.4469 4.7109 21.4125 7.3117 19.4291 279.5798 2.1524 102.0110 125.4114 211.3344 17.4666 221.8985 1.3793 2.5072 61.7963 162.4071 32.9227 45.7158 21.4599 5.7338 7.3946 3.1737 6.1802 2.2508 7.6525 0.6750 12.7223 28.8263 8.0506 6.6123 1.0373 29.8225 25.9249 20.2325 16.3328 1.6337 30.5687 95.6860
temp: 298.150 k
press: 1.00000 atm
elementType: 17 8 8 8 8 7 6 6 6 6 6 6 6 6 6 6 6 6 6 6 6 6 6 6 6 6 6 6 6 6 6 1 1 1 1 1 1 1 1 1 1 1 1 1 1 1 1 1 1 1 1 1 1
symmnumber: 1
zpe: 1074014.5 jmol-1
zpe.correction: 0.409071 hartree
zpe.thermalcorrener: 0.436558 hartree
zpe.thermalcorrenthalpy: 0.437502 hartree
zpe.thermalcorrgfe: 0.344979 hartree
zpe.sumelectzpe: -1779.398187 hartree
zpe.sumelectthermal: -1779.370700 hartree
zpe.sumelectthermalent: -1779.369755 hartree
zpe.sumelectthermalfe: -1779.462278 hartree
dipole: 7.0144 -0.5195 0.1596
dipole: 7.0354
quadrupole: -166.7397 -189.7385 -179.2886
quadrupole: -3.8887 -8.7363 6.7554
quadrupole: 11.8492 -11.1496 -0.6997 -3.8887 -8.7363 6.7554
hfenergy: -1779.8072571 hartree
pointgroup: C01 [X(C25H22Cl1N1O4)]
dipole: -2.7662024 0.0831307 -0.0527323 debye
polarizability: 451.4531753|46.0230793|206.9477463|-19.7415093|-3.3856606|280.0980788 unknown
InChI: InChI=1S/C25H22ClNO4/c26-16-24(29)27-22(15-18-7-3-1-4-8-18)25(30)31-17-23(28)21-13-11-20(12-14-21)19-9-5-2-6-10-19/h1-14,22,27H,15-17H2
charge 0 multiplicity 1
53 atoms
Cl 3.404233 2.907981 2.083747
O  1.774825 1.014292 -1.936644
O  2.17196 -1.2487 -2.332499
O  5.757483 2.382422 -1.20129
O  0.60659 0.190934 0.311037
N  3.948671 1.174912 -0.359683
C  3.990331 0.186073 -1.442476
C  4.790809 -1.103654 -1.072422
C  4.373878 -1.767084 0.233221
C  2.575605 -0.136659 -1.932652
C  3.377698 -2.777932 0.25991
C  4.981834 -1.381014 1.456651
C  0.333146 0.77671 -2.035528
C  -1.678238 0.248679 -0.470455
C  4.839681 2.209959 -0.333711
C  -4.498157 -0.040286 -0.05176
C  -0.204886 0.386534 -0.638392
C  2.998158 -3.383149 1.478932
C  4.602073 -1.98273 2.677488
C  -5.963894 -0.187553 0.16525
C  3.607187 -2.987309 2.692241
C  -2.592451 0.417073 -1.546915
C  -2.192847 -0.068598 0.817256
C  -3.975703 0.274643 -1.338372
C  -3.574259 -0.209398 1.020978
C  4.743154 3.241725 0.788703
C  -6.558918 0.180264 1.404493
C  -6.806998 -0.699439 -0.860643
C  -7.947694 0.043321 1.609898
C  -8.195328 -0.839644 -0.654775
C  -8.773287 -0.468037 0.58157
H  4.531475 0.676274 -2.280125
H  5.85278 -0.802352 -1.019404
H  4.681747 -1.807841 -1.916568
H  3.214031 1.105227 0.353687
H  2.897782 -3.079956 -0.677472
H  5.76525 -0.613077 1.449498
H  0.122276 -0.030337 -2.763473
H  -0.101015 1.726761 -2.385507
H  2.228307 -4.163316 1.48169
H  5.082934 -1.67234 3.612207
H  -2.23415 0.665108 -2.552049
H  -1.481394 -0.209436 1.637646
H  3.31311 -3.458022 3.637329
H  -4.664374 0.439519 -2.173695
H  -3.94598 -0.484007 2.013894
H  4.514304 4.227779 0.358139
H  5.696475 3.282167 1.335126
H  -5.937251 0.607584 2.199179
H  -6.369306 -1.0221 -1.812106
H  -8.38706 0.343017 2.567658
H  -8.824592 -1.246675 -1.45385
H  -9.851603 -0.575714 0.741538
