program: Gaussian 09
title: 000272826
version: EM64L-G09RevD.01
frameworkgroup: C1[X(C17H17NO4)]
method: RPBEPBE
basis: SDD
operation: Freq
keyword: #p
keyword: freq=noraman
keyword: PBEPBE/SDD
title: #p freq=noraman PBEPBE/SDD
converged: YES YES NO NO
title: Mulliken charges:
elementType: O O O O N C C C C C C C C C C C C C C C C C H H H H H H H H H H H H H H H H H
charge: -0.321433 -0.419916 -0.217580 -0.280651 -0.368286 -0.140913 -0.567659 0.521569 0.151296 -0.379078 -0.428331 0.185911 -0.384753 -0.255324 -0.226277 -0.246029 0.408529 -0.341420 -0.380946 -0.226661 -0.195431 -0.252603 0.288299 0.257431 0.217042 0.361223 0.259876 0.228146 0.244683 0.248544 0.231574 0.225620 0.228954 0.389382 0.252136 0.245558 0.227363 0.229352 0.230802
chargesum: 0.00000
title: Mulliken charges with hydrogens summed into heavy atoms:
elementType: O O O O N C C C C C C C C C C C C C C C C C
charge: -0.321433 -0.030534 -0.217580 -0.280651 -0.007063 0.147386 -0.093186 0.521569 0.151296 -0.119202 -0.200185 0.185911 0.108474 -0.023749 -0.000658 -0.017075 0.408529 -0.089283 -0.135389 0.000702 0.033921 -0.021801
polarizability: 2.05413199e+02 1.08133103e+01 1.88686423e+02 1.26642358e+01 -1.65537355e+01 1.89427360e+02
1716.lowfreq: -6.4719 -5.9875 -3.2351 -0.0008 -0.0004 0.0005 11.9804 14.7055 21.1252
frequency: 11.7985 14.5565 21.1017 28.9971 44.3339 49.3431 68.9143 76.1802 94.9435 141.3580 157.3611 165.4105 212.5937 223.0047 229.5420 282.4216 313.6173 331.2313 402.5503 405.2125 412.5127 442.5508 467.7671 500.4896 524.3936 548.6177 566.1099 573.3549 600.8694 610.4052 615.6822 621.9149 652.0253 685.4808 693.0248 698.6183 702.1402 740.4814 758.9740 801.3133 806.7046 824.5802 851.6986 867.7405 877.4689 892.4923 922.8054 951.6765 963.2350 975.5117 982.0079 985.1319 990.4216 994.2275 996.0829 1005.4840 1021.4167 1023.9187 1032.8170 1080.4574 1084.3723 1093.7144 1129.6730 1168.7009 1172.8761 1180.4282 1194.6314 1203.6053 1205.1560 1213.8169 1216.8057 1255.2372 1271.1386 1309.1180 1312.5736 1316.3317 1330.8177 1341.5845 1353.1798 1382.9678 1389.4603 1439.3695 1443.2529 1451.4542 1461.2450 1480.1955 1488.4372 1505.5958 1593.3737 1595.2016 1611.4017 1614.6953 1620.0565 1664.0523 2978.9307 2980.4744 3029.7100 3044.3594 3049.3812 3113.1059 3126.4399 3131.4243 3137.5245 3139.6198 3148.2058 3156.4852 3163.8850 3163.8990 3174.0530 3519.4994 3523.4794
redmass: 5.1530 5.7920 6.5056 4.0839 5.1419 6.6351 7.1079 4.8576 5.7062 5.1581 2.6658 6.0983 5.9330 4.4044 4.9947 4.5011 3.8312 4.9948 2.8116 4.7139 2.9816 5.0363 3.0000 2.9067 5.2920 4.4220 6.6380 2.6972 2.3144 6.3250 5.0718 2.3118 4.2032 1.3663 2.0811 2.9747 2.0302 1.5176 1.6066 5.2787 5.9550 1.2510 1.2578 1.9708 3.7295 1.4393 1.7076 4.1622 1.3651 1.4387 5.8717 1.3043 4.0443 3.4904 1.8032 1.8278 2.7690 2.1356 2.2665 2.1811 1.5269 1.7145 3.1169 1.0865 1.0576 1.1779 1.1773 1.1548 1.4590 2.4164 2.0775 1.7969 1.4853 1.8347 1.4403 1.3334 1.4100 1.4991 1.3069 5.9719 7.0943 1.9610 2.0224 1.2200 1.1616 2.0658 2.2498 2.1337 5.8747 6.4414 6.4197 6.0844 7.9668 9.2187 1.0594 1.0556 1.0966 1.1059 1.0880 1.0874 1.0862 1.0849 1.0913 1.0889 1.0959 1.0923 1.0967 1.1006 1.1011 1.0642 1.0773
irintensity: 0.1511 0.5393 1.5639 0.2419 0.1861 0.4011 3.3475 2.4546 0.6192 1.3399 17.2927 2.3422 4.6836 2.3018 0.0935 3.7919 0.8884 5.0235 0.5169 5.6725 0.2238 3.0375 11.1252 10.7264 40.5388 20.6915 3.9893 24.2149 74.3573 0.7141 7.5562 55.8138 2.3821 89.5851 88.0442 30.7264 45.5032 55.7454 96.8293 3.7758 40.2661 0.0878 1.2300 4.6528 47.7940 10.1034 6.8482 46.5816 0.0114 0.0415 6.0500 0.6438 0.2251 23.9191 12.3960 0.4844 9.1454 19.7000 7.7782 184.1750 17.9464 16.3188 21.0179 12.8798 0.0353 48.8104 7.8186 2.4649 7.2434 168.3752 79.6427 14.8000 16.9825 38.4596 0.5921 0.5668 9.1324 5.2396 3.6135 0.5263 9.1388 9.5298 10.9669 102.3624 29.7159 116.4239 16.4537 252.0959 2.0983 22.2723 113.3415 16.7823 153.7753 258.1267 17.0995 19.8201 9.2876 14.2649 13.4246 8.3221 0.2114 2.7695 17.4448 9.4698 27.7153 28.3716 13.1215 27.8478 6.6809 35.5155 80.0869
temp: 298.150 k
press: 1.00000 atm
elementType: 8 8 8 8 7 6 6 6 6 6 6 6 6 6 6 6 6 6 6 6 6 6 1 1 1 1 1 1 1 1 1 1 1 1 1 1 1 1 1
symmnumber: 1
zpe: 802766.5 jmol-1
zpe.correction: 0.305758 hartree
zpe.thermalcorrener: 0.326085 hartree
zpe.thermalcorrenthalpy: 0.327029 hartree
zpe.thermalcorrgfe: 0.251264 hartree
zpe.sumelectzpe: -1012.079378 hartree
zpe.sumelectthermal: -1012.059051 hartree
zpe.sumelectthermalent: -1012.058106 hartree
zpe.sumelectthermalfe: -1012.133872 hartree
dipole: -2.9686 -0.6937 -2.8860
dipole: 4.1980
quadrupole: -127.9351 -123.1096 -124.5801
quadrupole: -5.3637 -5.9448 -8.7080
quadrupole: -2.7268 2.0986 0.6281 -5.3637 -5.9448 -8.7080
hfenergy: -1012.3851358 hartree
pointgroup: C01[X(C17H17N1O4)]
dipole: -1.0886207 0.5503283 -1.1134786 debye
polarizability: 206.6063501|2.3143499|202.1989427|14.2861096|-11.5191875|174.7216885 unknown
InChI: InChI=1S/C17H17NO4/c19-16(12-22-14-9-5-2-6-10-14)18-15(17(20)21)11-13-7-3-1-4-8-13/h1-10,15,18,20H,11-12H2
charge 0 multiplicity 1
39 atoms
O  -1.820762 0.500012 0.330798
O  1.486236 3.129644 0.952059
O  3.585409 2.627581 1.813415
O  0.661364 -1.103371 2.445202
N  0.753485 0.553709 0.791467
C  2.186805 0.797947 0.922741
C  2.996323 0.46225 -0.373323
C  2.830781 -0.96499 -0.884446
C  2.511882 2.243074 1.306312
C  2.73917 -2.079097 -0.010811
C  2.827193 -1.199438 -2.283531
C  0.102112 -0.37023 1.571867
C  -1.403519 -0.49619 1.322843
C  2.657716 -3.39164 -0.527286
C  2.74817 -2.511176 -2.802364
C  2.665321 -3.615183 -1.923366
C  -3.180981 0.538757 -0.039487
C  -4.167386 -0.329725 0.486757
C  -3.522177 1.524462 -0.996675
C  -5.504113 -0.200078 0.042004
C  -4.858278 1.639363 -1.428526
C  -5.857951 0.778197 -0.912238
H  2.542605 0.160143 1.751988
H  4.062028 0.660291 -0.141961
H  2.707122 1.174605 -1.170258
H  0.184728 1.12516 0.159684
H  2.707466 -1.934185 1.074825
H  2.888646 -0.347589 -2.972902
H  -1.929326 -0.342187 2.285142
H  -1.611154 -1.523085 0.96241
H  2.583408 -4.238755 0.163759
H  2.748271 -2.669705 -3.886762
H  2.602264 -4.634484 -2.32048
H  1.753884 4.058088 1.191268
H  -3.916121 -1.095384 1.226708
H  -2.737775 2.182202 -1.383892
H  -6.268537 -0.871816 0.448159
H  -5.120194 2.402737 -2.169423
H  -6.89512 0.870681 -1.25028
