program: Gaussian 09
title: 000272829
version: EM64L-G09RevD.01
frameworkgroup: C1[X(C17H22O4)]
method: RPBEPBE
basis: SDD
operation: Freq
keyword: #pfreq=noraman
keyword: PBEPBE/SDD
title: #p freq=noraman PBEPBE/SDD
converged: YES YES NO NO
title: Mulliken charges:
elementType: O O O O C C C C C C C C C C C C C C C C C H H H H H H H H H H H H H H H H H H H H H H
charge: -0.305728 -0.240858 -0.414364 -0.233651 -0.046877 -0.004925 -0.430012 -0.437866 -0.432350 -0.399013 -0.359872 -0.403077 -0.771111 0.202195 0.146083 0.221506 -0.336023 -0.371800 -0.221845 -0.216777 0.085289 0.218821 0.239472 0.206146 0.198702 0.206537 0.236308 0.197474 0.201485 0.196818 0.219926 0.194561 0.190971 0.203174 0.200014 0.218304 0.217830 0.228842 0.267217 0.267836 0.237633 0.239600 0.383405
chargesum: 0.00000
title: Mulliken charges with hydrogens summed into heavy atoms:
elementType: O O O O C C C C C C C C C C C C C C C C C
charge: -0.305728 -0.240858 -0.030959 -0.233651 0.171944 0.234548 -0.025163 0.004980 -0.033391 0.017731 0.025660 0.000111 -0.106134 0.202195 0.146083 0.221506 -0.068805 -0.103964 0.015787 0.022822 0.085289
polarizability: 2.44902818e+02 -2.57873157e+00 1.92563213e+02 -6.22058739e+00 1.73081925e+01 1.46546430e+02
1716.lowfreq: -21.0899 -6.8512 -0.0006 -0.0006 0.0006 6.2989 8.1243 25.9768 36.9562
frequency: -12.0147 25.8732 36.8500 41.9103 75.5416 94.4438 118.2302 136.2715 141.9043 171.5671 186.1289 207.4934 221.0155 232.7661 245.6240 252.2988 293.5906 300.2368 329.9355 354.0725 372.9950 390.4977 396.2512 421.7372 439.5999 451.9577 491.1872 516.3852 546.1206 570.4906 601.2513 620.7428 651.7882 677.7150 706.6334 730.3931 738.4085 747.8153 783.6794 786.1289 801.8753 803.0713 809.9627 844.0476 855.3246 880.6054 902.4633 933.4205 949.4639 974.5734 976.2712 989.0812 1003.4411 1008.7563 1018.7091 1035.4383 1054.8869 1056.6175 1090.7371 1105.0773 1113.3891 1117.2835 1129.0808 1146.4120 1164.9888 1166.3594 1177.2458 1203.2827 1218.7602 1236.4284 1249.5780 1253.7308 1271.5406 1276.7744 1291.8883 1302.3389 1311.6323 1318.6471 1331.0941 1339.2330 1343.1472 1348.9966 1362.0800 1370.6890 1374.2299 1381.7699 1387.6142 1430.2005 1459.3097 1461.4086 1465.8322 1470.1013 1472.6933 1477.3506 1480.7149 1485.6614 1491.2693 1580.3643 1601.3588 1615.1255 1645.4751 2952.6494 2965.5499 2968.3330 2969.9592 2972.3074 2980.1626 2986.1777 2998.8142 3008.4393 3010.5767 3016.4843 3023.4771 3026.2352 3037.1196 3047.1747 3066.8044 3077.4970 3138.4457 3152.9012 3167.2931 3178.6486 3524.3786
redmass: 5.1406 4.0563 7.4475 4.5111 5.0823 5.1316 4.1731 2.6609 4.6436 5.7490 3.5168 2.3175 3.6839 2.0674 1.4043 3.0783 3.2416 4.1854 7.6328 2.3430 4.6571 2.2743 2.9431 3.4500 2.7623 2.0684 2.0885 2.9223 4.2953 1.5254 4.4305 3.2536 5.6030 5.1467 3.8415 2.9268 2.2736 2.1802 4.2972 1.5056 2.5366 3.1834 2.3037 2.1420 3.2948 1.8336 1.4402 1.8214 1.8361 1.5379 1.8156 1.8226 1.3545 5.3000 1.7755 5.2157 2.1934 1.8975 2.6706 1.5940 2.1020 1.9061 1.8771 1.9416 1.6702 1.7500 1.0623 1.2896 1.2747 2.5684 1.3437 1.2629 1.4401 1.1885 1.2110 1.2789 1.4186 2.5555 1.3281 1.4550 1.4351 1.4328 1.4232 1.3921 1.3905 10.2831 1.2369 2.2495 1.0776 1.0889 1.0809 1.0806 1.0591 2.6652 1.0561 1.0745 1.0802 7.2791 6.8366 10.0947 9.2904 1.0604 1.0629 1.0566 1.0633 1.0422 1.0646 1.0744 1.0716 1.0953 1.0875 1.0996 1.0959 1.1001 1.0991 1.0995 1.0983 1.0992 1.0863 1.0910 1.0960 1.0985 1.0640
irintensity: 0.2289 0.3405 0.2984 0.3938 0.0453 1.2213 1.9218 0.2893 2.4108 0.5840 2.3800 3.4148 0.9428 0.3344 1.6929 1.3529 3.9801 0.9450 1.6402 1.5012 4.8625 1.8350 3.6853 4.0027 1.4632 0.6679 2.1368 24.2438 6.6359 72.0554 36.4257 6.5314 9.5556 8.9560 86.5890 7.6602 7.4106 4.5700 17.6244 50.9198 2.3014 3.3628 5.2971 1.4385 15.9622 21.4942 1.7202 52.4825 2.2079 4.0720 11.3787 11.7706 1.8148 116.5326 17.7119 179.5688 140.3131 46.8817 16.8398 10.6578 8.0482 34.8654 11.1977 1.1201 29.2455 16.4529 0.3863 4.9010 6.3117 335.6289 21.9705 1.6616 0.4304 14.5258 3.2394 1.4593 3.5993 62.5778 1.2356 1.2125 0.1916 1.2023 0.1495 0.7365 2.1337 9.6808 13.9702 7.4388 1.2404 14.3496 4.0698 11.9629 5.4417 20.0296 11.1246 11.5138 31.2130 19.4334 59.5263 108.2198 260.4241 30.4886 30.4791 5.8846 14.3996 40.9472 32.3356 8.4529 11.2987 66.3556 65.6182 3.9430 37.5750 75.0882 41.0945 75.6816 47.4561 48.0917 1.6245 7.7753 12.2241 11.9927 33.2839
temp: 298.150 k
press: 1.00000 atm
elementType: 8 8 8 8 6 6 6 6 6 6 6 6 6 6 6 6 6 6 6 6 6 1 1 1 1 1 1 1 1 1 1 1 1 1 1 1 1 1 1 1 1 1 1
symmnumber: 1
zpe: 937847.5 jmol-1
zpe.correction: 0.357207 hartree
zpe.thermalcorrener: 0.376644 hartree
zpe.thermalcorrenthalpy: 0.377588 hartree
zpe.thermalcorrgfe: 0.309096 hartree
zpe.sumelectzpe: -960.327628 hartree
zpe.sumelectthermal: -960.308191 hartree
zpe.sumelectthermalent: -960.307247 hartree
zpe.sumelectthermalfe: -960.375739 hartree
dipole: 2.6969 1.8652 2.4675
dipole: 4.1038
quadrupole: -122.5082 -113.6189 -130.9176
quadrupole: -9.2696 -12.5247 0.2672
quadrupole: -0.1600 8.7294 -8.5694 -9.2696 -12.5247 0.2672
hfenergy: -960.6848352 hartree
pointgroup: C01 [X(C17H22O4)]
dipole: 1.0338185 0.6228223 1.0724071 debye
polarizability: 244.7230627|-6.655409|191.2348423|0.8972932|19.4059591|148.054556 unknown
InChI: InChI=1S/C17H22O4/c1-12-8-4-2-3-5-11-15(12)21-17(20)14-10-7-6-9-13(14)16(18)19/h6-7,9-10,12,15,18H,2-5,8,11H2,1H3
charge 0 multiplicity 1
43 atoms
O  0.44231 0.35166 -0.079849
O  -0.828715 -0.712948 -1.726113
O  -2.60158 -2.257598 -0.103247
O  -4.471048 -1.633656 -1.333477
C  2.782667 0.901978 -0.451464
C  1.715969 -0.195021 -0.687547
C  4.236328 0.385054 -0.698465
C  1.954804 -1.605065 -0.115027
C  5.058722 0.034033 0.570043
C  2.052155 -1.75534 1.420769
C  4.619873 -1.184584 1.426944
C  3.239042 -1.049301 2.132307
C  2.472051 2.123578 -1.35164
C  -0.755186 0.00128 -0.696525
C  -1.927352 0.641421 -0.012193
C  -3.227372 0.063419 -0.088955
C  -1.769134 1.909327 0.60079
C  -4.345552 0.785855 0.392208
C  -2.885086 2.610873 1.104467
C  -4.179127 2.055252 0.986069
C  -3.498795 -1.31392 -0.612408
H  2.701873 1.230076 0.601948
H  1.529002 -0.296369 -1.776179
H  4.790977 1.182887 -1.231303
H  4.225855 -0.478932 -1.393889
H  2.871236 -2.006077 -0.589396
H  1.125391 -2.24354 -0.475858
H  5.076874 0.928906 1.227638
H  6.108751 -0.134483 0.25281
H  2.123967 -2.842822 1.627498
H  1.103022 -1.416272 1.879051
H  5.401476 -1.328494 2.199526
H  4.639106 -2.105634 0.808898
H  3.308921 -1.478469 3.151429
H  3.012018 0.023888 2.280123
H  3.1512 2.964318 -1.119427
H  2.604582 1.867753 -2.420776
H  1.433748 2.474811 -1.211953
H  -0.766006 2.340091 0.661206
H  -5.339357 0.335423 0.304424
H  -2.747157 3.59132 1.572436
H  -5.05179 2.601874 1.358471
H  -2.790464 -3.142052 -0.518363
