program: Gaussian 09
title: 000272811
version: EM64L-G09RevD.01
frameworkgroup: C1[X(C16H17NO3)]
method: RPBEPBE
basis: SDD
operation: Freq
keyword: #p
keyword: freq=noraman
keyword: PBEPBE/SDD
title: #p freq=noraman PBEPBE/SDD
converged: YES YES NO NO
title: Mulliken charges:
elementType: O O O N C C C C C C C C C C C C C C C C H H H H H H H H H H H H H H H H H
charge: -0.204534 -0.208000 -0.218115 -0.167249 -0.250379 -0.231182 -0.447403 -0.437987 -0.376819 -0.401381 0.149952 0.147942 -0.505030 0.166843 0.294257 -0.325621 -0.340555 -0.246570 -0.225852 -0.217268 0.264119 0.262538 0.249303 0.229477 0.201385 0.237509 0.208339 0.188079 0.207937 0.218139 0.276995 0.272640 0.244590 0.277169 0.234016 0.236414 0.236302
chargesum: 0.00000
title: Mulliken charges with hydrogens summed into heavy atoms:
elementType: O O O N C C C C C C C C C C C C C C C C
charge: -0.204534 -0.208000 -0.218115 -0.167249 0.013740 0.031355 0.031378 0.000907 0.019599 0.024695 0.149952 0.147942 0.044605 0.166843 0.294257 -0.081031 -0.063386 -0.012554 0.010562 0.019034
polarizability: 2.42304186e+02 -7.67034963e+00 1.60052170e+02 -3.18593254e+00 3.45000690e+00 1.38193860e+02
1716.lowfreq: -10.2744 -0.0006 -0.0005 -0.0004 2.1786 13.6838 17.8633 33.1049 38.5808
frequency: 16.8923 32.8217 38.1291 62.8414 80.9894 103.2191 129.2212 146.3158 152.9895 203.6951 242.5279 257.7493 281.1580 318.9569 353.6944 363.1155 397.8841 403.7012 408.8846 441.8943 454.4177 532.2869 549.6780 562.9413 589.9104 613.1340 619.4128 637.2047 695.1840 698.2785 727.1489 758.3841 767.8585 794.8253 807.4542 831.6372 857.2951 872.9182 878.2520 907.1110 921.9156 946.8732 971.1592 974.6512 989.9072 991.5235 1011.2444 1026.4332 1028.9762 1058.5279 1066.5176 1077.2539 1087.3175 1089.9833 1119.7432 1141.0636 1163.6382 1175.0944 1183.7997 1190.3141 1219.6914 1229.0332 1233.6940 1260.1479 1295.1697 1296.6600 1309.6524 1315.0565 1317.0086 1328.4254 1334.4836 1344.9063 1350.9728 1357.7653 1368.2050 1389.4070 1414.2260 1437.8455 1458.3865 1466.4817 1468.8085 1482.0376 1484.3298 1577.0703 1602.7847 1616.3848 1633.1116 1695.3012 2959.8319 2968.4910 2981.9528 2986.9498 2989.2263 3005.2332 3038.7355 3040.9120 3045.8426 3052.2681 3066.1225 3072.0430 3131.3727 3140.2680 3150.8684 3160.6098 3171.3457
redmass: 4.5185 5.2906 4.8417 5.2170 4.9133 5.5003 5.2647 4.3101 4.9070 3.6520 2.8090 2.4667 6.2425 2.2226 3.6416 6.9692 2.8654 4.2962 3.4664 2.8580 6.1617 3.3824 3.2774 2.8442 7.8494 6.2986 3.5010 6.3102 1.8037 6.0548 4.0874 3.2413 1.7515 3.0715 2.8486 2.6633 1.2571 2.4800 2.2780 1.6426 2.1925 1.5802 4.8468 2.4394 6.2485 1.3867 1.3594 2.3032 2.2471 2.0193 1.8350 2.7606 1.6993 1.9497 1.1543 2.8837 2.1466 1.0658 1.3482 1.1231 1.3539 1.5038 2.8673 1.3883 1.4658 1.3416 1.5129 1.4391 1.7369 1.4985 1.3824 1.4532 1.4884 1.4802 3.5047 8.9228 1.1466 2.2674 1.0864 1.0835 1.0880 2.2157 1.0841 6.5779 6.8363 7.1052 11.9613 11.4734 1.0793 1.0643 1.0614 1.0662 1.0627 1.0582 1.0964 1.0979 1.0917 1.1027 1.0979 1.1020 1.0852 1.0881 1.0925 1.0964 1.1014
irintensity: 0.1442 1.3178 2.4613 1.3627 0.2638 0.9134 4.6515 0.6526 0.6057 2.5516 4.5153 7.2952 8.4348 1.9205 14.5894 0.2684 0.3753 9.1659 1.5911 1.6607 8.7654 1.5146 23.6951 5.1380 19.2529 0.4492 0.5374 7.9065 48.9192 2.9259 1.4557 4.4714 63.7626 3.1952 15.0175 2.2591 0.2895 3.4423 3.4016 37.8316 11.7054 0.5386 33.8492 13.6663 4.3885 0.4335 0.1365 7.8886 6.2875 1.1979 3.8226 33.8607 18.1823 16.8996 1.7982 45.7655 61.2851 4.0254 17.0965 27.8922 0.4755 8.2079 188.2044 2.8332 5.9604 2.9982 10.5360 4.8436 31.8783 31.3167 1.5398 1.5378 27.1840 13.2619 146.8754 3.4785 62.2741 24.9007 12.0255 12.2365 15.2775 1.7954 8.8712 80.6932 80.9638 17.1945 495.9747 13.0774 14.3874 43.5831 23.3170 43.9199 3.7428 32.3505 48.3060 46.7665 4.0070 34.5791 47.5376 0.3510 0.3748 5.5396 16.8138 17.7321 21.4594
temp: 298.150 k
press: 1.00000 atm
elementType: 8 8 8 7 6 6 6 6 6 6 6 6 6 6 6 6 6 6 6 6 1 1 1 1 1 1 1 1 1 1 1 1 1 1 1 1 1
symmnumber: 1
zpe: 783895.4 jmol-1
zpe.correction: 0.298570 hartree
zpe.thermalcorrener: 0.315831 hartree
zpe.thermalcorrenthalpy: 0.316775 hartree
zpe.thermalcorrgfe: 0.251358 hartree
zpe.sumelectzpe: -898.909884 hartree
zpe.sumelectthermal: -898.892623 hartree
zpe.sumelectthermalent: -898.891679 hartree
zpe.sumelectthermalfe: -898.957096 hartree
dipole: 1.3466 -0.7058 -0.4535
dipole: 1.5865
quadrupole: -82.3884 -110.3391 -135.6771
quadrupole: -0.9332 -2.1277 3.0303
quadrupole: 27.0798 -0.8709 -26.2089 -0.9332 -2.1277 3.0303
hfenergy: -899.2084536 hartree
pointgroup: C01 [X(C16H17N1O3)]
dipole: 0.5325123 -0.0774127 -0.3163182 debye
polarizability: 242.2289412|-6.1671219|145.3244779|-6.0615562|10.8558069|152.9967963 unknown
InChI: InChI=1S/C16H17NO3/c18-14(11-6-2-1-3-7-11)10-17-15(19)12-8-4-5-9-13(12)16(17)20/h1-3,6-7,12-13H,4-5,8-10H2
charge 0 multiplicity 1
37 atoms
O  -1.141694 -2.544507 0.659765
O  -1.178895 1.169148 -2.191328
O  0.583352 0.655031 1.033452
N  -0.858181 -0.727689 -0.822407
C  -3.00049 -0.914109 0.184904
C  -3.10883 -0.018881 -1.08797
C  -3.018403 -0.09897 1.521871
C  -4.011118 1.231979 -1.000126
C  -4.118673 0.983795 1.526181
C  -3.901351 1.966942 0.354112
C  -1.610249 -1.546261 0.063598
C  -1.641999 0.274407 -1.444911
C  0.589623 -0.793279 -0.933477
C  1.277399 0.053974 0.167555
C  2.771731 0.126534 0.160946
C  3.563897 -0.549512 -0.80731
C  3.412861 0.904796 1.163975
C  4.970279 -0.445882 -0.771862
C  4.816561 1.006887 1.197601
C  5.598884 0.331695 0.228817
H  -3.781514 -1.692387 0.214589
H  -3.481267 -0.651162 -1.922351
H  -2.0356 0.393781 1.65831
H  -3.143024 -0.808487 2.359724
H  -5.062702 0.917023 -1.151022
H  -3.749673 1.908764 -1.835089
H  -4.094031 1.522323 2.492478
H  -5.12162 0.516164 1.440509
H  -4.645082 2.785371 0.387577
H  -2.901269 2.434827 0.451514
H  0.904803 -1.848585 -0.833373
H  0.88502 -0.416578 -1.929467
H  3.094455 -1.15617 -1.588898
H  2.784882 1.416785 1.900585
H  5.576015 -0.967795 -1.520299
H  5.303806 1.608499 1.972332
H  6.691398 0.411232 0.253896
