program: Gaussian 09
title: 000272810
version: EM64L-G09RevD.01
frameworkgroup: C1[X(C16H16ClNO3)]
method: RPBEPBE
basis: SDD
operation: Freq
keyword: #p
keyword: freq=noraman
keyword: PBEPBE/SDD
title: #p freq=noraman PBEPBE/SDD
converged: NO YES NO NO
title: Mulliken charges:
elementType: Cl O O O N C C C C C C C C C C C C C C C C H H H H H H H H H H H H H H H H
charge: -0.046635 -0.202707 -0.208598 -0.077528 -0.212190 -0.255565 -0.222467 -0.436526 -0.438345 -0.377583 -0.403036 0.198847 0.142514 -0.240228 0.494922 -0.069638 -0.416832 -0.323261 -0.228281 -0.239902 -0.234363 0.271247 0.272473 0.227864 0.238159 0.206350 0.239487 0.213190 0.192760 0.214765 0.212186 0.295021 0.241094 0.276871 0.231381 0.231833 0.232721
chargesum: 0.00000
title: Mulliken charges with hydrogens summed into heavy atoms:
elementType: Cl O O O N C C C C C C C C C C C C C C C C
charge: -0.046635 -0.202707 -0.208598 -0.077528 -0.212190 0.015681 0.050006 0.029497 0.007493 0.028367 0.023915 0.198847 0.142514 0.054793 0.494922 -0.069638 -0.175737 -0.046390 0.003100 -0.008069 -0.001642
polarizability: 2.32619643e+02 -1.34445317e+01 1.57382417e+02 4.71246407e+00 1.17548799e+01 1.69786931e+02
1716.lowfreq: -0.0020 -0.0010 -0.0008 4.8363 6.3478 14.7856 29.8029 32.0233 44.0613
frequency: 29.3899 31.9991 44.0296 51.6568 71.8975 87.6311 106.7665 116.4481 141.6556 194.1599 200.1634 221.5653 224.9949 247.8673 321.8213 326.6555 348.7508 374.0783 405.7545 415.1843 421.2578 440.4930 456.6781 514.7943 532.0966 563.7870 597.4290 616.4100 620.1320 643.1185 659.8302 702.5275 720.7832 758.6690 768.5128 783.5858 801.3329 821.1059 852.1410 856.1885 874.6763 891.0414 914.0033 928.4417 960.9034 973.9457 981.9022 993.6691 1002.4505 1006.7333 1030.4403 1053.8282 1064.0619 1068.5140 1084.2693 1095.8410 1120.3108 1133.4500 1164.1318 1175.8169 1185.4263 1197.4045 1205.7725 1220.1906 1229.8358 1259.4993 1267.4012 1291.8061 1296.3679 1303.0046 1314.8628 1326.8197 1335.6904 1343.8728 1346.0891 1348.8197 1358.5014 1385.6063 1446.0846 1460.2310 1468.5390 1469.2658 1478.0532 1485.1928 1594.5306 1612.8260 1630.5340 1691.8475 1735.4561 2957.4697 2961.2674 2972.3607 2980.4545 2984.4273 2990.7605 3041.8607 3043.3161 3050.2734 3054.4923 3068.6816 3123.2082 3132.5993 3146.4667 3159.7716 3170.4293
redmass: 7.5114 4.9478 6.6285 5.0391 6.2454 4.6821 6.3778 5.5367 5.4503 6.0846 4.6889 5.8297 4.4930 3.5027 2.3717 7.5415 3.6974 5.1534 2.8153 5.2594 8.6526 2.8041 6.2705 4.0921 3.9761 3.7286 4.8563 6.4622 4.3832 6.5322 5.7660 1.9285 3.9747 2.5902 3.0450 2.4447 3.8264 2.4621 3.0489 1.2659 2.5077 2.1425 1.8721 1.4743 2.6234 3.9398 1.4813 4.3682 1.4328 2.5333 2.2380 2.4419 2.1088 1.9320 1.9362 2.1845 1.1859 2.7702 2.4803 1.0599 1.3815 1.1795 2.1673 1.3732 1.4574 1.3901 1.5579 1.6495 1.4595 2.4149 1.6703 1.7545 1.3670 1.4292 1.2977 1.3674 1.4423 6.6610 2.1419 1.0839 1.0840 1.0857 1.0876 2.2273 6.0921 5.9420 11.9467 12.0299 12.6658 1.0800 1.0796 1.0653 1.0624 1.0634 1.0647 1.0966 1.0980 1.0924 1.1024 1.0950 1.0875 1.0878 1.0926 1.0963 1.1005
irintensity: 0.1923 0.7075 0.5898 0.8788 0.1957 0.9203 1.2165 1.4525 4.3736 0.9131 1.3506 3.1057 1.5510 1.5966 4.2664 1.5994 25.9374 1.5507 0.3783 4.7425 21.3806 3.6158 15.6514 1.5779 11.5758 16.0783 26.3748 4.4340 9.6261 35.0493 64.4162 44.5948 70.1252 23.8277 13.4167 5.9916 11.7119 35.6015 16.5673 2.3481 5.6992 28.1930 4.2096 2.0470 4.0754 45.7585 2.4866 5.7490 1.8060 5.1506 4.1231 13.6772 14.3392 10.0564 45.9789 8.6251 5.0707 50.9230 73.0028 0.2031 17.2545 1.1982 12.4636 8.6913 0.8331 1.6036 1.0342 69.2169 22.2964 89.3236 20.7739 130.2521 1.0590 5.4981 6.6183 18.4446 6.4286 3.4431 11.6763 13.7216 7.5390 18.3736 11.8296 14.7985 8.3329 2.8940 392.8253 32.0325 230.1065 32.6072 14.3093 31.6731 24.1284 17.0099 30.0753 48.9535 42.2444 3.0601 33.4273 42.6053 3.2449 3.1013 21.4732 14.3630 16.7534
temp: 298.150 k
press: 1.00000 atm
elementType: 17 8 8 8 7 6 6 6 6 6 6 6 6 6 6 6 6 6 6 6 6 1 1 1 1 1 1 1 1 1 1 1 1 1 1 1 1
symmnumber: 1
zpe: 758068.4 jmol-1
zpe.correction: 0.288733 hartree
zpe.thermalcorrener: 0.307244 hartree
zpe.thermalcorrenthalpy: 0.308188 hartree
zpe.thermalcorrgfe: 0.240210 hartree
zpe.sumelectzpe: -1358.298134 hartree
zpe.sumelectthermal: -1358.279623 hartree
zpe.sumelectthermalent: -1358.278679 hartree
zpe.sumelectthermalfe: -1358.346657 hartree
dipole: -2.1839 -3.7369 0.5143
dipole: 4.3587
quadrupole: -111.1205 -133.5690 -135.3566
quadrupole: -5.9872 -2.0971 -2.8699
quadrupole: 15.5615 -6.8869 -8.6746 -5.9872 -2.0971 -2.8699
hfenergy: -1358.5868671 hartree
pointgroup: C01 [X(C16H16Cl1N1O3)]
dipole: 0.7412171 1.5174572 0.2976955 debye
polarizability: 234.3612361|-7.3392752|156.7445086|-0.3890875|-12.9403448|168.6832467 unknown
InChI: InChI=1S/C16H16ClNO3/c17-14(19)13(10-6-2-1-3-7-10)18-15(20)11-8-4-5-9-12(11)16(18)21/h1-3,6-7,11-13H,4-5,8-9H2
charge 0 multiplicity 1
37 atoms
Cl -2.449344 -2.944063 -1.118789
O  0.07967 -0.654189 2.170105
O  1.11659 0.871674 -2.142968
O  0.071068 -2.822845 -0.093768
N  0.321282 -0.014867 -0.102932
C  2.169441 0.441692 1.316523
C  2.272158 1.339458 0.045871
C  3.155062 -0.77451 1.299142
C  3.675188 1.542005 -0.566652
C  4.574912 -0.363667 0.854652
C  4.53451 0.258679 -0.559507
C  0.744714 -0.119614 1.255012
C  1.232983 0.729792 -0.90275
C  -0.895537 -0.609888 -0.68844
C  -2.189689 0.096321 -0.277026
C  -0.857413 -2.134464 -0.492554
C  -2.795841 0.979671 -1.203497
C  -2.773365 -0.088394 1.001623
C  -3.97498 1.676541 -0.85897
C  -3.953969 0.606081 1.341279
C  -4.55793 1.488934 0.415083
H  2.313437 1.018139 2.245368
H  1.86033 2.340012 0.299232
H  2.774819 -1.546846 0.60068
H  3.160346 -1.23307 2.304013
H  4.199183 2.325223 0.015586
H  3.555956 1.927814 -1.596282
H  5.231946 -1.25363 0.867683
H  5.005101 0.366414 1.570967
H  5.555762 0.501339 -0.908076
H  4.119795 -0.481159 -1.273593
H  -0.767647 -0.465436 -1.784605
H  -2.34701 1.121472 -2.194335
H  -2.295957 -0.755375 1.726221
H  -4.438308 2.355957 -1.582554
H  -4.403279 0.458139 2.329345
H  -5.475684 2.024059 0.683515
