program: Gaussian 09
title: 000272804
version: EM64L-G09RevD.01
frameworkgroup: C1[X(C16H13NOS)]
method: RPBEPBE
basis: SDD
operation: Freq
keyword: #p
keyword: freq=noraman
keyword: PBEPBE/SDD
title: #p freq=noraman PBEPBE/SDD
converged: YES YES NO NO
title: Mulliken charges:
elementType: S O N C C C C C C C C C C C C C C C C H H H H H H H H H H H H H
charge: 0.214452 -0.170024 -0.447223 -0.638782 0.559125 0.489821 -0.294899 -0.380221 -0.432741 -0.360887 0.472817 -0.219699 -0.220574 -0.234735 -0.392318 -0.406040 -0.244553 -0.246126 -0.243120 0.298259 0.310048 0.186656 0.236556 0.264449 0.232188 0.231825 0.234189 0.306187 0.215157 0.226593 0.225109 0.228510
chargesum: 0.00000
title: Mulliken charges with hydrogens summed into heavy atoms:
elementType: S O N C C C C C C C C C C C C C C C C
charge: 0.214452 -0.170024 -0.137175 -0.340523 0.559125 0.489821 -0.294899 -0.193565 -0.196185 -0.096439 0.472817 0.012489 0.011252 -0.000546 -0.086131 -0.190883 -0.017960 -0.021017 -0.014610
polarizability: 4.13808158e+02 -1.52326139e+01 1.68712410e+02 1.69988356e+01 4.04087438e+00 1.24713867e+02
1716.lowfreq: -7.0847 0.0013 0.0017 0.0024 3.3297 7.1788 25.5964 35.6006 39.0705
frequency: 25.5698 35.5897 39.0583 63.0722 76.8460 116.0680 139.1192 180.5626 218.0132 248.0407 256.7986 267.7786 309.3793 341.5624 395.3884 405.0426 412.3748 416.0850 480.3974 509.5983 526.3240 561.7073 595.7608 603.1943 613.3441 619.2065 678.0089 678.8691 698.8390 703.8039 729.2142 768.4708 782.5765 823.2715 847.4680 849.4999 857.1453 883.1333 921.5117 933.9920 936.8597 982.0869 982.8359 986.7590 990.0596 1002.0314 1011.7153 1024.2116 1030.6245 1074.0853 1090.4227 1107.6078 1171.7973 1173.9851 1181.9453 1185.3267 1204.2130 1215.0860 1227.8206 1260.5476 1290.3892 1336.0435 1341.1015 1362.7279 1389.6438 1391.0830 1431.9376 1445.7612 1458.7735 1482.0112 1483.0421 1570.2582 1589.8620 1596.5938 1610.0447 1612.8629 1640.0351 2964.5032 3052.7584 3109.1070 3120.0556 3127.3625 3130.3433 3140.8300 3141.8086 3153.0454 3160.5220 3167.9574 3189.3056 3575.4872
redmass: 4.9429 3.8695 5.1350 7.1327 6.3893 5.8483 6.0451 5.2052 5.2365 5.7855 5.3904 2.4559 3.5723 2.0454 4.0925 2.8166 4.8072 5.1082 5.0161 2.9872 5.6963 6.0336 6.8497 5.9261 6.4104 6.5852 6.9182 6.6644 1.7558 1.8821 3.7010 1.7697 2.1418 5.2261 2.8635 1.5331 1.2665 1.4202 4.9573 1.5108 1.4992 1.3633 1.3981 6.1297 5.8869 1.3316 1.3241 2.1983 2.2200 1.9019 1.6945 3.1524 1.0878 1.0602 1.1920 1.2013 1.1315 2.0741 2.1975 1.7942 1.5339 1.6805 1.3466 2.2278 3.2828 6.1000 2.1112 2.1484 1.6037 2.3219 2.2346 5.6973 6.2957 6.0825 5.9789 6.0914 9.9015 1.0858 1.0855 1.0875 1.0879 1.0868 1.0863 1.0934 1.0912 1.0962 1.0999 1.1015 1.0947 1.0778
irintensity: 0.0953 0.0077 0.2578 3.7833 0.2837 1.2553 2.6327 1.9309 1.5056 6.4621 0.2939 9.4673 26.5756 49.0850 5.4716 0.7635 5.6804 4.3945 8.9478 23.8075 19.0935 25.8036 9.2760 4.8747 1.1742 4.7231 11.9407 53.8038 58.9585 39.0165 28.3884 37.3898 34.7134 102.2394 13.1711 8.1629 0.2160 22.1698 200.7127 8.7008 17.3996 0.0456 0.3774 3.9116 1.2850 0.2206 2.1912 13.5607 12.2577 8.2599 20.9620 9.7497 7.2846 0.7294 17.2498 101.0637 3.6459 4.3345 34.6179 172.0593 13.5317 103.1017 2.3963 256.9237 99.8098 1.3179 22.9177 22.0432 18.0131 10.6757 3.4934 29.9314 77.7203 4.2100 5.5041 5.3658 66.1423 45.3190 24.5156 12.3009 6.9787 0.0061 0.5691 36.8030 13.2332 32.1042 42.2690 26.3076 27.6210 50.6800
temp: 298.150 k
press: 1.00000 atm
elementType: 16 8 7 6 6 6 6 6 6 6 6 6 6 6 6 6 6 6 6 1 1 1 1 1 1 1 1 1 1 1 1 1
symmnumber: 1
zpe: 643094.3 jmol-1
zpe.correction: 0.244942 hartree
zpe.thermalcorrener: 0.261165 hartree
zpe.thermalcorrenthalpy: 0.262110 hartree
zpe.thermalcorrgfe: 0.199064 hartree
zpe.sumelectzpe: -1144.214017 hartree
zpe.sumelectthermal: -1144.197793 hartree
zpe.sumelectthermalent: -1144.196849 hartree
zpe.sumelectthermalfe: -1144.259895 hartree
dipole: -2.9300 -4.2527 -1.2794
dipole: 5.3205
quadrupole: -99.1587 -120.7025 -115.4976
quadrupole: 0.7546 2.6106 -0.6404
quadrupole: 12.6276 -8.9162 -3.7114 0.7546 2.6106 -0.6404
hfenergy: -1144.4589584 hartree
pointgroup: C01 [X(C16H13N1O1S1)]
dipole: 1.239151 -1.3855726 0.9624542 debye
polarizability: 412.3102668|29.2298374|164.0080911|3.3740152|-16.7376323|130.9160768 unknown
InChI: InChI=1S/C16H13NOS/c18-16-14(11-12-7-3-1-4-8-12)17-15(19-16)13-9-5-2-6-10-13/h1-11,15,17H
charge 0 multiplicity 1
32 atoms
S  1.311062 2.223992 -0.649693
O  -1.391579 2.191743 -1.098382
N  0.809403 -0.052925 0.648593
C  1.918547 0.893034 0.605518
C  3.233566 0.25616 0.208201
C  -0.492309 0.339995 0.282681
C  -0.455868 1.589901 -0.530997
C  -1.589827 -0.42426 0.665223
C  4.417398 0.59023 0.910036
C  3.296741 -0.670041 -0.864465
C  -3.029306 -0.415136 0.397296
C  5.65247 0.007691 0.546228
C  4.528535 -1.255376 -1.224433
C  5.710002 -0.917569 -0.520702
C  -3.746918 0.506995 -0.428765
C  -3.785469 -1.451196 1.03998
C  -5.141469 0.385013 -0.594164
C  -5.177443 -1.56532 0.872507
C  -5.868571 -0.64403 0.049773
H  2.036078 1.452582 1.555129
H  0.975126 -0.967877 1.06618
H  -1.30388 -1.259878 1.326199
H  4.372477 1.305514 1.740931
H  2.381192 -0.914709 -1.414566
H  6.563752 0.271616 1.093807
H  4.572747 -1.967842 -2.055564
H  6.666438 -1.37085 -0.803751
H  -3.208369 1.31292 -0.929443
H  -3.260755 -2.173355 1.679351
H  -5.666714 1.104328 -1.232934
H  -5.723578 -2.368881 1.379319
H  -6.952678 -0.72687 -0.085892
