program: Gaussian 09
title: 000272795
version: EM64L-G09RevD.01
frameworkgroup: C1[X(C15H19NO2)]
method: RPBEPBE
basis: SDD
operation: Freq
keyword: #p
keyword: freq=noraman
keyword: PBEPBE/SDD
title: #p freq=noraman PBEPBE/SDD
converged: YES YES NO NO
title: Mulliken charges:
elementType: O O N C C C C C C C C C C C C C C C H H H H H H H H H H H H H H H H H H H
charge: -0.330615 -0.274343 -0.465019 -0.429078 -0.003474 -0.376685 -0.388160 -0.504888 -0.460873 -0.165318 -0.168680 0.259068 0.482966 -0.448243 -0.357907 -0.196002 -0.211338 -0.258326 0.236771 0.221388 0.252648 0.187940 0.204556 0.200431 0.207138 0.218235 0.204896 0.199507 0.200356 0.222406 0.211624 0.327203 0.221993 0.299987 0.225785 0.225748 0.228306
chargesum: 0.00000
title: Mulliken charges with hydrogens summed into heavy atoms:
elementType: O O N C C C C C C C C C C C C C C C
charge: -0.330615 -0.274343 -0.137815 0.029080 0.249174 0.015811 0.019409 -0.081757 -0.061010 0.057088 0.042944 0.259068 0.482966 -0.226250 -0.057920 0.029783 0.014410 -0.030021
polarizability: 2.61887792e+02 3.13001491e+00 1.60030780e+02 -1.64230033e+00 -1.11845126e+01 1.10250847e+02
1716.lowfreq: -20.5313 -7.4053 -0.0005 -0.0003 -0.0002 3.3260 21.4718 31.4518 40.6372
frequency: 18.9337 31.2200 40.6122 72.5703 86.6211 109.8937 151.7829 171.2486 194.8140 234.8627 245.0973 249.5885 275.6318 334.0288 344.6765 375.9035 405.0685 407.7701 453.8472 483.9647 509.1535 537.4328 598.9847 609.3317 619.0569 638.9286 695.1986 696.8574 699.7324 725.0799 765.8275 774.2356 780.4376 819.5779 840.9994 856.5839 866.7214 869.5413 911.3067 912.8165 956.0213 970.8285 976.1204 980.9403 986.9879 989.5318 995.5078 1014.2561 1028.9213 1040.4563 1087.6266 1090.7911 1106.8432 1111.4114 1158.2750 1172.2555 1174.2656 1189.1875 1189.4347 1220.5183 1242.0326 1249.8675 1258.2442 1262.6997 1294.7866 1314.0685 1314.9153 1324.9337 1334.4060 1340.8615 1351.9845 1361.8249 1386.2708 1388.9344 1432.8227 1455.3820 1459.8256 1466.0908 1469.5247 1483.1838 1485.5847 1514.7587 1600.1853 1617.4485 1655.8284 1667.7315 2963.5514 2968.3974 2972.2744 2994.3177 3000.0142 3014.2604 3023.3992 3026.4014 3034.9487 3055.4587 3062.0411 3088.2042 3113.3465 3125.9477 3131.7963 3144.0760 3165.1972 3189.9378 3542.0192
redmass: 4.1864 4.5712 4.0355 7.6732 4.9749 4.6501 3.2180 2.2389 4.6647 3.5023 4.1096 3.8664 2.9146 3.1004 4.2156 2.7216 2.2230 2.9195 2.8706 2.1799 2.8268 2.3824 4.9494 3.5963 4.1039 1.2937 2.5720 2.4631 3.6474 3.0483 1.6714 1.8560 2.5559 2.6658 1.2672 2.7139 3.6831 1.7778 2.4107 1.4344 2.2599 1.3542 1.4742 4.2993 3.9874 2.5854 1.3053 2.4156 2.1107 2.2156 2.0939 1.8386 2.0479 1.5985 2.6764 1.0555 1.5512 1.2019 1.1729 1.1829 1.2181 1.1825 1.8945 1.1624 1.4174 1.2235 1.3307 1.3962 1.3245 1.4211 1.3586 1.3719 7.0133 1.4983 2.3728 1.1120 1.0888 1.0824 1.0931 1.0912 2.2182 2.2780 5.3490 6.0283 8.4920 6.8221 1.0607 1.0633 1.0633 1.0632 1.0638 1.0834 1.0954 1.0975 1.0998 1.0995 1.1022 1.0855 1.0882 1.0980 1.0869 1.0935 1.0996 1.0952 1.0759
irintensity: 0.2084 1.1148 0.2905 3.7761 0.8077 0.4112 0.0548 0.1661 3.9937 1.5565 9.3906 3.8235 7.7988 1.1433 4.3238 2.1539 0.4943 0.0029 0.7258 6.9385 25.7284 4.1263 0.6525 8.0634 2.3754 28.3131 6.2922 4.3032 76.9316 1.4223 97.9541 79.0417 16.2570 7.1826 0.4633 3.3432 1.4769 7.9972 8.4721 13.9658 4.5686 0.0535 25.8577 180.2223 93.6980 48.5130 2.4167 50.2367 3.5048 42.6743 45.2520 12.5966 11.4216 24.6680 428.7993 0.7523 67.0584 3.2469 5.6069 5.6560 0.7247 2.5388 5.0744 0.2126 5.3959 1.9167 4.9958 67.0547 0.6578 0.2014 13.9111 14.1821 53.3598 0.6152 127.9739 4.6338 3.1097 12.1600 6.5801 36.1721 13.7203 570.6401 31.5324 115.7823 205.4694 4.4379 31.1404 24.8438 46.5721 12.9093 10.6385 26.0820 51.8373 47.6711 70.9682 17.0443 25.3564 17.3280 14.2729 42.3922 0.7356 31.9780 24.9896 6.5945 25.9812
temp: 298.150 k
press: 1.00000 atm
elementType: 8 8 7 6 6 6 6 6 6 6 6 6 6 6 6 6 6 6 1 1 1 1 1 1 1 1 1 1 1 1 1 1 1 1 1 1 1
symmnumber: 1
zpe: 814692.2 jmol-1
zpe.correction: 0.310300 hartree
zpe.thermalcorrener: 0.326912 hartree
zpe.thermalcorrenthalpy: 0.327857 hartree
zpe.thermalcorrgfe: 0.264276 hartree
zpe.sumelectzpe: -786.850523 hartree
zpe.sumelectthermal: -786.833911 hartree
zpe.sumelectthermalent: -786.832967 hartree
zpe.sumelectthermalfe: -786.896547 hartree
dipole: -1.2607 1.5775 -0.8305
dipole: 2.1835
quadrupole: -94.2593 -103.9826 -109.5354
quadrupole: 6.4821 -1.3327 -2.0411
quadrupole: 8.3331 -1.3902 -6.9430 6.4821 -1.3327 -2.0411
hfenergy: -787.1608231 hartree
pointgroup: C01 [X(C15H19N1O2)]
dipole: 0.5000109 0.5897303 0.3743813 debye
polarizability: 261.5644321|-6.3431919|159.044622|3.6834606|13.4354635|111.5603642 unknown
InChI: InChI=1S/C15H19NO2/c17-15(16-13-9-5-4-6-10-13)18-14-11-7-2-1-3-8-12-14/h2,4-7,9-10,14,16H,1,3,8,11-12H2
charge 0 multiplicity 1
37 atoms
O  0.545894 0.485324 -0.253352
O  -0.763974 -1.407506 -0.78233
N  -1.6876 0.625207 0.0226
C  2.220526 -1.076895 0.667027
C  1.794852 -0.285955 -0.58623
C  3.567858 -1.846019 0.521192
C  4.806412 -1.189621 1.188945
C  2.809902 0.758152 -1.107272
C  5.359623 0.099999 0.507026
C  3.387715 1.648981 -0.027449
C  4.501546 1.342682 0.692412
C  -0.664334 -0.222024 -0.374213
C  -3.082982 0.354623 0.061053
C  -3.937246 1.399302 0.506865
C  -3.638587 -0.89581 -0.32025
C  -5.330641 1.198083 0.571675
C  -5.036286 -1.079663 -0.248643
C  -5.891359 -0.044462 0.194055
H  1.407119 -1.793501 0.884182
H  2.278655 -0.37858 1.522018
H  1.529729 -0.989191 -1.399812
H  3.786064 -2.034466 -0.550906
H  3.44381 -2.847484 0.977139
H  5.624478 -1.938795 1.199382
H  4.569972 -0.96811 2.24897
H  2.304704 1.357267 -1.886808
H  3.619857 0.193153 -1.607341
H  5.501352 -0.113822 -0.572002
H  6.367441 0.300368 0.91856
H  2.831678 2.565362 0.211125
H  4.812602 2.033903 1.489366
H  -1.380869 1.553769 0.320754
H  -3.509745 2.366392 0.801707
H  -2.979588 -1.696117 -0.662636
H  -5.977068 2.012531 0.916976
H  -5.458699 -2.046836 -0.543909
H  -6.973905 -0.201446 0.244324
