program: Gaussian 09
title: 000272841
version: EM64L-G09RevD.01
frameworkgroup: C1[X(C19H15NO5)]
method: RPBEPBE
basis: SDD
operation: Freq
keyword: #p
keyword: freq=noraman
keyword: PBEPBE/SDD
title: #p freq=noraman PBEPBE/SDD
converged: YES YES NO NO
title: Mulliken charges:
elementType: O O O O O N C C C C C C C C C C C C C C C C C C C H H H H H H H H H H H H H H H
charge: -0.262677 -0.238273 -0.187189 -0.237511 -0.118756 -0.218436 -0.514128 0.442785 0.103246 -0.392022 0.293362 0.465201 -0.481321 0.091566 0.454994 -0.381117 -0.378083 -0.372285 -0.360386 -0.244422 -0.223926 -0.234682 -0.217401 -0.243290 -0.225305 0.291402 0.274764 0.235662 0.244521 0.235627 0.225517 0.284712 0.260279 0.239062 0.229354 0.230750 0.232049 0.233077 0.232195 0.231087
chargesum: 0.00000
title: Mulliken charges with hydrogens summed into heavy atoms:
elementType: O O O O O N C C C C C C C C C C C C C C C C C C C
charge: -0.262677 -0.238273 -0.187189 -0.237511 -0.118756 -0.218436 0.052038 0.442785 0.103246 -0.156360 0.293362 0.465201 -0.001173 0.091566 0.454994 -0.155600 -0.093372 -0.112006 -0.121324 -0.015068 0.006824 -0.002632 0.015676 -0.011095 0.005781
polarizability: 3.51275323e+02 5.68423850e+01 2.10395801e+02 -4.10886528e+01 3.87552188e+01 1.66841321e+02
1716.lowfreq: -10.1864 -5.5254 -2.6455 -0.0004 0.0002 0.0006 7.3836 21.3200 24.1852
frequency: 4.8144 21.2645 23.9540 40.0675 44.8488 51.4249 67.8528 72.6946 93.7878 112.4642 156.1751 163.3399 207.2001 223.5570 249.4598 253.2665 294.5923 301.5497 339.3207 342.2262 359.2700 384.6993 402.5265 404.3859 457.0782 481.9890 514.2917 532.5098 563.8897 591.2864 601.1959 605.5670 616.5012 617.5164 625.5900 656.5149 695.4806 696.9883 702.5809 728.2787 737.5178 759.5117 768.7076 787.9119 817.4251 831.5024 846.6626 856.0136 866.8381 882.6219 894.3221 928.5284 934.7193 935.5657 975.1704 981.8579 983.6655 987.6231 990.7798 1001.6113 1002.6343 1026.3282 1028.1484 1029.9872 1052.0505 1090.3533 1091.8275 1156.3458 1174.7312 1175.0957 1186.9988 1191.8007 1201.1701 1220.0079 1228.0535 1239.3080 1297.1198 1316.4442 1329.4505 1341.4602 1343.1803 1356.6795 1374.5007 1386.1315 1390.6539 1438.4061 1442.6851 1446.7796 1462.1746 1484.9790 1486.8658 1577.2438 1594.4605 1608.7167 1614.1217 1633.0911 1647.5688 1670.7109 1736.9830 3005.8306 3045.8669 3075.1709 3119.7959 3123.4827 3125.1471 3125.6746 3130.1692 3131.8495 3142.7522 3145.3335 3154.4200 3163.0091 3168.0658 3185.7993
redmass: 5.3481 6.2611 4.1863 4.7500 5.7544 5.6523 8.7738 8.7307 6.7958 6.3028 8.3280 6.4317 6.0686 3.7110 4.8629 5.5192 7.5278 4.3568 6.1888 3.3188 4.0158 5.0638 2.7978 2.8353 8.2302 4.0206 3.3223 4.0362 7.9353 5.2662 6.6703 6.3218 6.5717 6.1824 6.9019 5.8765 5.0274 1.8593 1.8606 8.9506 4.8559 3.2619 1.7060 3.5807 3.5468 5.7893 1.3129 1.2526 1.3378 6.9053 6.4160 2.9543 1.5371 1.4904 1.8511 1.4206 1.3979 5.9142 5.6638 1.3325 1.3278 2.2122 2.3550 5.2055 3.4507 1.6933 1.5150 2.4652 1.0659 1.0656 1.7624 1.9106 1.1478 2.3983 1.2638 1.8834 1.6369 2.1451 1.2686 1.3550 1.3110 1.6891 4.8232 8.3008 3.4501 1.3163 2.1669 1.6861 1.1296 2.3096 2.3102 5.6270 6.0867 5.8138 6.0742 10.4766 11.8398 8.4871 12.9184 1.0613 1.0593 1.1001 1.0873 1.1030 1.0880 1.0910 1.0881 1.0876 1.0920 1.0936 1.0965 1.0993 1.1016 1.0954
irintensity: 0.2786 0.3046 0.4704 0.9944 0.4340 0.8703 1.4775 0.2898 3.5263 0.4761 0.3442 1.0758 4.5610 1.9164 2.7545 3.0046 1.1123 3.7450 0.9869 1.1368 1.1133 11.3968 0.0159 0.0302 4.8796 14.5986 26.8350 5.7819 15.7875 23.2263 0.9938 7.8676 1.0950 4.1962 7.0743 1.9648 5.2399 73.3071 43.6861 2.8648 29.3777 63.3651 27.8976 5.0738 10.0386 3.8149 18.0476 0.9826 16.8687 58.0674 132.0753 14.3271 0.3397 16.8482 7.9517 0.5324 0.1198 0.8153 0.4703 0.2572 0.6366 1.9646 2.5189 11.2860 31.7586 6.6063 5.0223 17.9497 1.3780 1.3700 117.5379 109.7032 10.7800 16.7464 14.0376 40.8609 8.6525 42.8061 2.2143 11.3378 15.1262 25.8272 53.8779 1.2131 8.1223 28.6277 9.1775 15.4083 19.8046 4.6177 3.0411 1.9233 2.0327 1.5584 0.6349 197.1662 403.4626 5.0772 745.6272 13.5452 27.8395 4.2521 3.5692 1.0280 17.1792 5.1222 0.6001 0.6821 10.5003 29.8630 22.4098 33.1799 13.3624 5.9864
temp: 298.150 k
press: 1.00000 atm
elementType: 8 8 8 8 8 7 6 6 6 6 6 6 6 6 6 6 6 6 6 6 6 6 6 6 6 1 1 1 1 1 1 1 1 1 1 1 1 1 1 1
symmnumber: 1
zpe: 783483.3 jmol-1
zpe.correction: 0.298413 hartree
zpe.thermalcorrener: 0.320003 hartree
zpe.thermalcorrenthalpy: 0.320948 hartree
zpe.thermalcorrgfe: 0.242783 hartree
zpe.sumelectzpe: -1162.132841 hartree
zpe.sumelectthermal: -1162.111251 hartree
zpe.sumelectthermalent: -1162.110307 hartree
zpe.sumelectthermalfe: -1162.188471 hartree
dipole: 6.2264 -1.0192 -1.3919
dipole: 6.4610
quadrupole: -157.5392 -143.6930 -142.0895
quadrupole: 9.4589 8.1079 -4.5789
quadrupole: -9.7653 4.0809 5.6844 9.4589 8.1079 -4.5789
hfenergy: -1162.4312542 hartree
pointgroup: C01 [X(C19H15N1O5)]
dipole: 0.0907919 -2.2947767 -1.0895978 debye
polarizability: 171.1527704|-85.0108505|336.9968928|21.5662379|27.7087292|220.3627809 unknown
InChI: InChI=1S/C19H15NO5/c21-17(24-13-15-9-5-2-6-10-15)12-20-16(25-19(23)18(20)22)11-14-7-3-1-4-8-14/h1-11H,12-13H2
charge 0 multiplicity 1
40 atoms
O  1.207231 1.916137 1.756751
O  -2.113634 1.305759 -0.705669
O  -0.680235 4.751862 0.593552
O  -1.693435 1.355253 -3.00558
O  0.722395 3.723919 3.185452
N  0.185021 2.660879 -0.140153
C  -0.326629 2.726133 -1.503678
C  0.921638 1.587995 0.41025
C  -0.053176 3.683486 0.792968
C  1.297702 0.426816 -0.202912
C  -1.435898 1.716028 -1.835443
C  2.059815 -0.698066 0.34162
C  -3.188396 0.249389 -0.909466
C  0.624524 3.209114 2.072435
C  -2.584662 -1.135254 -0.907669
C  2.270858 -1.82555 -0.508564
C  2.603383 -0.734547 1.662581
C  -2.299291 -1.796618 -2.129962
C  -2.289164 -1.784001 0.318942
C  2.997497 -2.946579 -0.063265
C  3.329558 -1.859152 2.101514
C  -1.726425 -3.088137 -2.12364
C  -1.710043 -3.07118 0.325643
C  3.53309 -2.969189 1.246122
C  -1.429898 -3.726518 -0.896597
H  -0.740254 3.745157 -1.6339
H  0.480716 2.589766 -2.243714
H  0.972023 0.320883 -1.245497
H  -3.707366 0.478976 -1.855204
H  -3.847914 0.427231 -0.046808
H  1.850831 -1.818213 -1.522249
H  2.454263 0.114536 2.333649
H  -2.516619 -1.290681 -3.077399
H  -2.505566 -1.275656 1.266346
H  3.147523 -3.800082 -0.733488
H  3.741832 -1.870977 3.116648
H  -1.515121 -3.59566 -3.071355
H  -1.477897 -3.561902 1.276811
H  4.101497 -3.838146 1.595514
H  -0.985072 -4.727911 -0.891186
