program: Gaussian 09
title: 000272796
version: EM64L-G09RevD.01
frameworkgroup: C1[X(C15H19NO5)]
method: RPBEPBE
basis: SDD
operation: Freq
keyword: #p
keyword: freq=noraman
keyword: PBEPBE/SDD
title: #p freq=noraman PBEPBE/SDD
converged: YES YES NO NO
title: Mulliken charges:
elementType: O O O O O N C C C C C C C C C C C C C C C H H H H H H H H H H H H H H H H H H H
charge: -0.274266 -0.444046 -0.249445 -0.212942 -0.242409 -0.410986 -0.053612 -0.116865 -0.708940 -0.714437 -0.296690 0.200035 0.127025 0.431066 -0.439691 -0.363361 -0.222066 -0.220879 -0.237586 0.320593 -0.757972 0.257195 0.289565 0.379139 0.210301 0.222607 0.243564 0.216901 0.221303 0.227906 0.280485 0.244209 0.258024 0.390071 0.231926 0.230662 0.232404 0.262611 0.245675 0.242923
chargesum: 0.00000
title: Mulliken charges with hydrogens summed into heavy atoms:
elementType: O O O O O N C C C C C C C C C C C C C C C
charge: -0.274266 -0.053975 -0.249445 -0.212942 -0.242409 -0.031847 0.203584 0.172700 -0.032468 -0.048327 -0.016205 0.200035 0.127025 0.431066 -0.195482 -0.105338 0.009860 0.009784 -0.005182 0.320593 -0.006763
polarizability: 1.72416110e+02 -4.34216947e+00 2.09961005e+02 5.42449537e-01 -2.66863274e+00 1.62577036e+02
1716.lowfreq: -11.6730 -7.8740 -4.1613 0.0004 0.0005 0.0007 10.8433 19.4126 27.0011
frequency: -6.8198 19.2351 26.1787 31.0125 43.5457 49.7026 58.5681 70.7526 79.9440 85.2850 119.8017 130.3898 151.4016 206.0616 218.1076 226.3858 232.2478 248.7211 273.4897 283.3379 322.9807 330.0945 345.3637 401.5178 404.5648 435.3763 444.4265 509.6928 528.9447 544.3270 553.5785 586.5618 613.7848 616.9821 624.9988 637.7865 649.5019 687.2426 702.3167 729.8310 775.6955 817.3546 837.7338 853.0220 856.2941 875.5066 913.5385 922.3558 937.7606 944.3745 962.5102 972.5348 980.1648 990.0376 997.5216 1000.5645 1028.1470 1042.5988 1050.9611 1082.5857 1100.3817 1113.0575 1146.5236 1174.4876 1179.6109 1186.7060 1193.2204 1206.1974 1218.9897 1236.6201 1270.9090 1285.2383 1295.5989 1298.9385 1336.0917 1342.0079 1348.0008 1379.9104 1382.9952 1385.2937 1398.9204 1442.0275 1453.6925 1454.0302 1466.1579 1469.4734 1475.2123 1481.9442 1484.7635 1485.6408 1592.6914 1611.1838 1615.3154 1665.8320 1671.4273 2973.4284 2982.7099 2990.6902 3006.4066 3008.2445 3021.8559 3067.5751 3075.0374 3078.0906 3088.3716 3101.1288 3122.3731 3130.4722 3142.6268 3142.6719 3153.8053 3167.5101 3524.9560 3526.0269
redmass: 5.5146 3.9304 3.6670 4.6148 4.7215 6.3321 5.0707 2.2330 1.6801 3.0626 4.9151 5.1144 4.8591 1.1457 2.5576 5.1470 1.3159 4.0174 4.1264 4.1169 4.0097 7.1862 4.5984 2.8245 3.4968 2.6611 3.7563 5.4202 3.5969 3.3083 3.2380 3.5302 2.9744 2.3435 2.5114 1.9638 3.0428 3.3502 2.0451 2.7405 2.7631 3.4866 4.6909 3.0225 1.3440 5.4558 1.4058 1.6672 1.9718 3.1290 1.5146 3.9280 1.3982 5.9304 2.0344 1.3948 2.1318 1.6464 1.8866 1.6060 5.3138 1.8087 2.2425 1.0576 2.0861 1.2888 2.3891 1.7346 1.9622 1.3642 1.4735 1.9250 1.6003 1.2384 1.3215 1.5098 1.5372 1.2122 1.4502 3.9979 1.2089 2.1603 1.0541 1.0560 1.0977 1.1013 1.6577 1.0483 2.2937 1.0795 6.1103 7.8649 7.1621 9.7952 8.8642 1.0361 1.0360 1.0818 1.0845 1.0374 1.0840 1.0994 1.0998 1.0989 1.0993 1.0954 1.0872 1.0869 1.0928 1.1010 1.0963 1.1016 1.0658 1.0767
irintensity: 0.6290 0.0836 0.0586 0.2485 0.1892 1.7243 3.4900 4.0613 0.9449 1.6984 6.5792 0.7950 0.7268 0.2366 4.1577 2.1334 1.0799 2.1456 2.9654 3.0383 1.3916 3.2572 2.4238 0.4798 4.9937 3.9112 11.2487 20.3459 39.7994 49.0267 1.5458 22.8678 32.5377 43.9472 48.8495 38.5993 3.2578 49.0274 48.8946 46.8238 15.3411 3.3759 15.2342 30.0140 4.0827 15.4931 9.4630 8.5554 19.7200 18.6219 2.6400 68.8269 0.8547 6.4896 105.4525 13.9033 2.3726 9.9401 117.0366 11.1415 14.9742 59.7048 10.4138 0.9184 13.3821 86.3074 293.8520 2.8689 24.8195 9.1803 2.4431 37.0562 6.0850 8.7868 0.1626 1.7931 12.3778 21.4748 49.0161 14.8257 20.5661 6.8282 19.3393 21.7798 33.2233 42.7067 258.3710 17.9437 14.0566 39.4817 5.2384 120.8267 47.9620 202.6762 222.1275 23.2374 25.3145 20.2056 3.7765 1.6125 7.8917 30.7826 9.4141 49.6615 28.7690 7.5355 4.2190 0.2509 21.1438 5.5245 25.0574 18.0122 10.0118 78.0965
temp: 298.150 k
press: 1.00000 atm
elementType: 8 8 8 8 8 7 6 6 6 6 6 6 6 6 6 6 6 6 6 6 6 1 1 1 1 1 1 1 1 1 1 1 1 1 1 1 1 1 1 1
symmnumber: 1
zpe: 832710.8 jmol-1
zpe.correction: 0.317163 hartree
zpe.thermalcorrener: 0.338654 hartree
zpe.thermalcorrenthalpy: 0.339598 hartree
zpe.thermalcorrgfe: 0.263599 hartree
zpe.sumelectzpe: -1012.320219 hartree
zpe.sumelectthermal: -1012.298728 hartree
zpe.sumelectthermalent: -1012.297784 hartree
zpe.sumelectthermalfe: -1012.373783 hartree
dipole: -0.3874 4.8096 2.1004
dipole: 5.2625
quadrupole: -130.5068 -117.7056 -119.5845
quadrupole: -3.8706 4.1572 -10.1317
quadrupole: -7.9078 4.8934 3.0144 -3.8706 4.1572 -10.1317
hfenergy: -1012.637382 hartree
pointgroup: C01 [X(C15H19N1O5)]
dipole: -0.7463963 1.9303187 0.0586148 debye
polarizability: 173.9802748|-7.4165497|197.8147331|-6.3800676|18.9665155|173.1591425 unknown
InChI: InChI=1S/C15H19NO5/c1-9(2)12(15(19)20)16-14(18)13(21-10(3)17)11-7-5-4-6-8-11/h4-9,12-13,16,19H,1-3H3
charge 0 multiplicity 1
40 atoms
O  -1.896977 -1.772919 -0.530648
O  2.298292 1.926406 1.832749
O  0.840321 -1.887464 -0.743011
O  4.431574 1.248712 1.215015
O  -1.787256 -3.730026 0.747603
N  1.056965 0.123022 0.40485
C  2.671548 0.822578 -1.409151
C  2.477672 0.27346 0.059521
C  4.121729 0.628562 -1.901568
C  2.20154 2.286908 -1.551025
C  -1.120231 -1.05734 0.509735
C  0.342202 -0.972142 -0.023397
C  3.19578 1.153896 1.071826
C  -1.790327 0.270167 0.802213
C  -1.984539 0.688063 2.141809
C  -2.208579 1.117531 -0.257042
C  -2.581449 1.938792 2.423508
C  -2.811355 2.361803 0.024189
C  -2.995734 2.778396 1.364969
C  -2.095242 -3.15305 -0.315795
C  -2.713385 -3.779424 -1.541723
H  2.010479 0.173169 -2.015357
H  2.94735 -0.72832 0.085295
H  0.610918 0.854083 0.965127
H  4.208481 0.957218 -2.953412
H  4.42239 -0.434166 -1.852644
H  4.839275 1.211726 -1.298111
H  2.876375 2.98157 -1.015583
H  2.200051 2.581706 -2.615853
H  1.176931 2.428407 -1.160626
H  -1.093191 -1.699392 1.413716
H  -1.680261 0.030728 2.965578
H  -2.07689 0.786059 -1.292654
H  2.805864 2.510344 2.458022
H  -2.730412 2.250432 3.463101
H  -3.139738 3.007086 -0.798232
H  -3.464026 3.745146 1.580716
H  -1.917642 -3.954559 -2.288407
H  -3.456941 -3.104921 -1.995302
H  -3.173362 -4.743046 -1.278401
