program: Gaussian 09
title: 000272784
version: EM64L-G09RevD.01
frameworkgroup: C1[X(C14H12O2S)]
method: RPBEPBE
basis: SDD
operation: Freq
keyword: #p
keyword: freq=noraman
keyword: PBEPBE/SDD
title: #p freq=noraman PBEPBE/SDD
converged: YES YES NO NO
title: Mulliken charges:
elementType: S O O C C C C C C C C C C C C C C H H H H H H H H H H H H
charge: 0.013931 -0.405590 -0.213700 -0.619454 0.473436 0.489254 0.207968 -0.401542 -0.367642 -0.345070 -0.329125 -0.226817 -0.240990 -0.242154 -0.242799 -0.243148 -0.243122 0.262924 0.259570 0.277375 0.231972 0.147774 0.228355 0.227855 0.229276 0.226443 0.230609 0.230094 0.384318
chargesum: 0.00000
title: Mulliken charges with hydrogens summed into heavy atoms:
elementType: S O O C C C C C C C C C C C C C C
charge: 0.161704 -0.021272 -0.213700 -0.619454 0.473436 0.489254 0.207968 -0.138618 -0.108072 -0.067695 -0.097154 0.001538 -0.013136 -0.012878 -0.016356 -0.012539 -0.013028
polarizability: 2.01012627e+02 -4.77845660e+00 1.62765275e+02 -1.37281348e+01 -8.05736074e+00 1.33116154e+02
1716.lowfreq: -10.0775 -4.7157 -0.0021 -0.0019 -0.0008 5.8202 27.4601 44.7893 69.6826
frequency: 27.2048 44.7841 69.6684 75.7727 98.3491 136.3557 185.7839 212.9703 243.0152 248.2877 287.6028 293.8001 315.4006 353.2223 381.0735 401.1788 407.8449 491.2766 501.4420 548.0829 604.2421 612.4495 615.4927 620.9308 664.3074 698.1812 699.9748 709.8849 752.6038 765.3131 801.9293 849.0109 850.5057 861.2293 886.3280 926.3844 934.7511 963.5961 977.6404 988.2641 990.8656 992.1379 996.4189 1000.9860 1029.4068 1032.0476 1061.4105 1088.6551 1093.5141 1156.4474 1173.4671 1174.0977 1195.3316 1197.8389 1209.3750 1289.0082 1319.7797 1327.1502 1376.1925 1381.5475 1430.5890 1437.2657 1476.0212 1482.6379 1586.9122 1591.7854 1605.5614 1611.2398 1636.4284 2398.8735 3125.4648 3125.6577 3133.3925 3135.5099 3145.4320 3149.1247 3154.5985 3156.6952 3166.8604 3167.2011 3502.9205
redmass: 4.1521 4.1124 8.4867 5.8572 5.6428 6.2206 6.9532 7.5042 3.7698 4.1117 4.1606 1.5641 3.3587 6.9685 8.7561 2.8208 2.8476 3.3786 3.6755 2.4798 3.7696 3.0550 6.1115 2.8797 5.4134 2.2331 2.8625 1.8946 1.8368 1.8653 1.4217 1.2757 4.3365 1.2445 7.0321 1.5568 1.5306 3.0690 1.3997 1.9877 2.8761 5.1781 1.3188 1.3303 2.3513 2.1460 2.4642 1.6098 1.6716 3.3892 1.0605 1.0510 1.1221 1.1335 3.6848 2.0514 1.3861 1.3372 7.0598 8.6240 2.2277 2.2592 2.1307 2.1879 6.0257 6.2009 6.0437 6.0606 9.3983 1.0370 1.0846 1.0848 1.0879 1.0884 1.0926 1.0923 1.0960 1.0952 1.1012 1.1012 1.0639
irintensity: 0.2946 0.1352 0.3282 0.3580 0.8434 0.5158 1.9700 1.6350 1.7385 2.3512 1.7969 22.4593 5.6936 5.3440 2.0261 0.2225 0.4498 5.8093 5.5464 18.4974 57.3715 40.8675 2.4064 64.7140 28.0495 50.9858 16.6504 52.7113 75.4888 23.6614 16.8995 0.1725 15.0840 0.2868 6.1988 3.6906 6.5207 15.4657 0.1846 0.7257 0.7257 1.0672 0.7000 1.6499 4.5104 15.2703 142.9663 12.1521 46.8715 4.0718 0.0832 0.1593 6.1059 1.0313 11.4298 18.3828 0.7543 1.0429 0.2146 0.3852 13.6561 7.8699 21.4588 19.0892 1.2904 5.1083 6.1687 7.4777 175.0305 6.3674 1.2048 0.0736 2.9224 10.8113 25.5105 12.1019 30.0029 14.5979 30.9715 11.1360 30.9420
temp: 298.150 k
press: 1.00000 atm
elementType: 16 8 8 6 6 6 6 6 6 6 6 6 6 6 6 6 6 1 1 1 1 1 1 1 1 1 1 1 1
symmnumber: 1
zpe: 570690.4 jmol-1
zpe.correction: 0.217364 hartree
zpe.thermalcorrener: 0.232515 hartree
zpe.thermalcorrenthalpy: 0.233460 hartree
zpe.thermalcorrgfe: 0.174072 hartree
zpe.sumelectzpe: -1087.993688 hartree
zpe.sumelectthermal: -1087.978537 hartree
zpe.sumelectthermalent: -1087.977593 hartree
zpe.sumelectthermalfe: -1088.036980 hartree
dipole: 0.3442 -1.4768 1.8561
dipole: 2.3968
quadrupole: -95.3829 -104.9980 -101.2442
quadrupole: -3.1926 -4.2712 2.8105
quadrupole: 5.1588 -4.4563 -0.7025 -3.1926 -4.2712 2.8105
hfenergy: -1088.2110522 hartree
pointgroup: C01 [X(C14H12O2S1)]
dipole: -0.0479417 -0.1835673 0.9236871 debye
polarizability: 201.6907702|-12.0499402|137.4242918|1.0588663|14.4826779|157.7789935 unknown
InChI: InChI=1S/C14H12O2S/c15-13(16)14(17,11-7-3-1-4-8-11)12-9-5-2-6-10-12/h1-10,15,17H
charge 0 multiplicity 1
29 atoms
S  -0.026194 0.382406 -2.745829
O  0.368952 -2.44434 0.104485
O  -0.767112 -2.448167 -1.907518
C  -0.049515 -0.265579 -0.928194
C  -1.301354 0.185014 -0.125514
C  1.275688 0.228737 -0.326993
C  -0.176733 -1.806778 -1.01118
C  -2.361224 0.918388 -0.70555
C  1.316331 1.424911 0.430057
C  -1.386986 -0.178419 1.247107
C  2.492892 -0.440454 -0.614245
C  -3.48921 1.282308 0.066624
C  2.546073 1.931237 0.907985
C  -2.512281 0.184682 2.015166
C  3.719098 0.059275 -0.131724
C  -3.571686 0.916162 1.427769
C  3.751551 1.248939 0.63385
H  -2.291265 1.220521 -1.754966
H  0.388137 1.963339 0.646362
H  -0.570156 -0.743632 1.707761
H  2.4835 -1.351496 -1.222383
H  -0.927309 -0.562796 -3.223793
H  -4.299852 1.853798 -0.399127
H  2.559818 2.859234 1.490328
H  -2.561851 -0.102208 3.071572
H  4.649899 -0.472983 -0.357008
H  -4.446921 1.19684 2.024267
H  4.705263 1.639856 1.005752
H  0.170544 -3.419099 0.047643
