program: Gaussian 09
title: 000272789
version: EM64L-G09RevD.01
frameworkgroup: C1[X(C14H20O4)]
method: RPBEPBE
basis: SDD
operation: Freq
keyword: #pfreq=noraman
keyword: PBEPBE/SDD
title: #p freq=noraman PBEPBE/SDD
converged: YES YES NO NO
title: Mulliken charges:
elementType: O O O O C C C C C C C C C C C C C C H H H H H H H H H H H H H H H H H H H H
charge: -0.274953 -0.269741 -0.227689 -0.227742 0.077182 -0.282398 -0.176290 -0.216089 -0.560947 -0.219370 -0.224950 -0.750417 0.204608 0.216207 -0.263902 -0.256361 -0.662167 -0.666075 0.287069 0.285209 0.241622 0.257932 0.252431 0.238782 0.240204 0.238638 0.219527 0.223664 0.235245 0.222890 0.233299 0.221624 0.218188 0.225271 0.247426 0.216699 0.223406 0.251968
chargesum: 0.00000
title: Mulliken charges with hydrogens summed into heavy atoms:
elementType: O O O O C C C C C C C C C C C C C C
charge: -0.274953 -0.269741 -0.227689 -0.227742 0.077182 0.004671 0.108919 0.025533 -0.050585 0.019412 0.015255 -0.068588 0.204608 0.216207 0.194232 0.198562 0.028719 0.025998
polarizability: 1.68747862e+02 1.67123205e+00 1.62880663e+02 -1.92218264e+00 4.60622640e+00 1.34130588e+02
1716.lowfreq: -17.1782 -14.8136 -9.4753 -0.0008 -0.0006 -0.0004 20.4752 41.0983 52.3256
frequency: 18.2546 41.0735 52.2403 61.5976 83.1053 87.7346 99.4201 121.9281 144.0932 160.0111 191.0421 199.1349 210.8591 226.3550 250.5672 273.8274 303.9719 318.8346 348.4768 361.9035 403.5965 418.2671 436.7957 450.1166 498.3051 538.5331 631.6106 658.0110 690.8624 717.8246 734.0194 743.8020 760.4004 790.5234 799.9519 805.1973 816.0597 818.4843 865.3550 898.9548 908.8232 926.5771 929.3023 950.1666 975.1900 977.8009 988.7046 1013.3927 1023.6194 1031.4678 1061.3640 1075.5895 1091.1023 1093.2963 1095.6440 1098.8065 1106.3289 1151.9951 1156.4942 1156.7738 1160.0917 1187.3773 1227.7548 1241.9139 1248.5780 1259.8548 1277.5159 1278.3957 1291.6895 1315.8833 1346.2944 1353.2237 1354.3737 1387.4627 1389.4023 1390.3775 1455.3741 1456.5563 1462.3183 1463.6082 1472.2691 1476.7011 1483.5505 1485.1325 1488.8676 1580.7766 1620.4072 1645.1073 2979.2479 2991.7881 2992.8671 3028.2695 3029.7490 3033.7195 3034.3645 3071.9002 3076.4694 3083.0592 3085.8329 3087.2162 3092.2949 3093.5037 3108.6470 3117.8546 3119.1065 3119.5281 3157.1301 3189.7785
redmass: 3.0561 3.6985 2.9240 4.0386 4.4553 4.5249 4.1361 3.2176 3.3105 3.4803 1.2133 2.6550 1.2313 1.3854 2.5602 4.9117 2.4989 3.0620 3.7149 3.5464 3.9859 5.7008 3.3383 3.4376 2.1945 3.0938 5.8673 3.8118 3.0211 3.4635 2.2993 3.1390 4.1049 3.6097 2.2327 2.4100 1.5482 2.0221 2.4805 2.0770 2.0904 1.8459 2.2570 2.8737 2.2929 2.0531 2.0079 2.0692 2.0789 3.4066 1.7687 2.0776 2.0649 1.4071 2.0261 2.1089 1.4879 2.3950 1.7974 1.8345 2.7215 4.9147 1.6070 1.3913 1.6057 1.3971 1.1179 1.1179 1.4486 1.7637 1.2856 1.2717 1.2857 1.2212 1.2331 1.2157 1.0950 1.0914 1.0449 1.0429 1.0525 1.0600 1.0814 1.0516 1.0558 5.7413 10.0236 10.5044 1.0359 1.0359 1.0360 1.0593 1.0594 1.0780 1.0680 1.0958 1.0929 1.0990 1.0978 1.0974 1.1029 1.1031 1.1058 1.1057 1.0916 1.1054 1.0873 1.1096
irintensity: 0.1966 0.8484 0.3196 1.7951 0.1497 0.1488 0.2996 0.7040 2.1809 1.5681 0.7053 1.6572 2.3874 1.6954 3.7284 2.1229 7.6492 19.6692 2.5673 1.1173 7.7076 0.7314 3.9501 0.6828 2.5910 2.0139 6.8788 4.4968 23.6516 12.1420 42.5829 0.4134 3.9976 13.2573 2.9468 1.9400 3.2670 5.5090 6.5183 3.7713 4.2715 6.9685 3.4988 18.6213 9.6052 0.1013 1.0910 71.0152 80.8199 62.8353 26.1319 82.4462 54.6570 18.2556 48.8803 44.1117 24.5428 101.7703 30.9033 26.9305 109.9359 206.5314 12.4581 4.6497 0.5058 3.7096 3.9980 3.8800 1.5754 11.5979 3.5040 0.4835 1.6011 4.1859 24.3509 30.5641 15.7671 10.7036 14.2846 13.0507 7.6972 25.9877 32.3322 14.2718 5.4529 1.9130 264.5556 24.4074 27.8916 20.6228 18.1710 20.8554 38.5013 7.9594 18.2212 13.8699 62.3244 35.8054 36.8666 30.7457 2.9436 1.2250 22.3642 25.9311 10.1169 33.0468 6.8457 19.3250
temp: 298.150 k
press: 1.00000 atm
elementType: 8 8 8 8 6 6 6 6 6 6 6 6 6 6 6 6 6 6 1 1 1 1 1 1 1 1 1 1 1 1 1 1 1 1 1 1 1 1
symmnumber: 1
zpe: 826241.1 jmol-1
zpe.correction: 0.314699 hartree
zpe.thermalcorrener: 0.333577 hartree
zpe.thermalcorrenthalpy: 0.334521 hartree
zpe.thermalcorrgfe: 0.266572 hartree
zpe.sumelectzpe: -844.968952 hartree
zpe.sumelectthermal: -844.950074 hartree
zpe.sumelectthermalent: -844.949130 hartree
zpe.sumelectthermalfe: -845.017079 hartree
dipole: -0.3002 -1.4607 0.1490
dipole: 1.4987
quadrupole: -96.1257 -95.2215 -115.9898
quadrupole: 0.3648 -5.4824 4.9470
quadrupole: 6.3199 7.2242 -13.5441 0.3648 -5.4824 4.9470
hfenergy: -845.2836507 hartree
pointgroup: C01 [X(C14H20O4)]
dipole: 0.5607731 -0.1684412 -0.0694707 debye
polarizability: 165.72521|3.3278274|165.7231821|2.0742841|-5.1591661|134.3107212 unknown
InChI: InChI=1S/C14H20O4/c1-4-17-12(15)14(13(16)18-5-2)9(3)10-6-7-11(14)8-10/h6-7,9-11H,4-5,8H2,1-3H3
charge 0 multiplicity 1
38 atoms
O  2.09719 0.90268 -0.278806
O  1.063212 -1.860974 0.529093
O  1.007091 1.729135 1.604176
O  0.284637 -1.597735 -1.651042
C  -0.165331 0.149181 0.078169
C  -1.193109 -0.131123 1.272623
C  -1.072652 0.90397 -0.995994
C  -2.482265 0.9359 -0.267339
C  -2.051685 1.167478 1.213615
C  -2.198743 -1.156172 0.732084
C  -2.97351 -0.513556 -0.190275
C  -0.591536 2.306907 -1.419904
C  1.003801 1.009296 0.58044
C  0.399755 -1.165751 -0.484457
C  3.323033 1.679864 0.087438
C  1.677846 -3.169788 0.148793
C  3.252711 3.106662 -0.463429
C  0.648549 -4.300474 0.232532
H  -0.689659 -0.37283 2.217335
H  -1.113064 0.26189 -1.893476
H  -3.177747 1.664267 -0.712539
H  -1.466707 2.085267 1.384139
H  -2.90256 1.128782 1.914249
H  -2.200657 -2.219445 0.98546
H  -3.73369 -0.953279 -0.84139
H  0.40051 2.25745 -1.902241
H  -1.301358 2.736307 -2.150352
H  -0.524543 3.003735 -0.564127
H  3.420801 1.677055 1.187256
H  4.1396 1.098973 -0.370334
H  2.09148 -3.077941 -0.870921
H  2.491537 -3.294827 0.881107
H  4.202546 3.632553 -0.252468
H  3.098397 3.101094 -1.556339
H  2.433803 3.67152 0.012197
H  1.14166 -5.269476 0.02978
H  0.19727 -4.347929 1.23896
H  -0.149813 -4.157268 -0.514615
