program: Gaussian 09
title: 000026239
version: EM64L-G09RevD.01
frameworkgroup: C1[X(C14H21NO3)]
method: RPBEPBE
basis: SDD
operation: Freq
keyword: #p
keyword: freq=noraman
keyword: PBEPBE/SDD
title: #p freq=noraman PBEPBE/SDD
converged: YES YES NO NO
title: Mulliken charges:
elementType: O O O N C C C C C C C C C C C C C C H H H H H H H H H H H H H H H H H H H H H
charge: -0.232408 -0.460884 -0.234105 -0.711799 -0.360547 -0.366075 -0.355022 -0.416319 -0.355882 -0.316645 -0.697354 0.225818 0.149055 -0.317118 -0.517827 0.557502 -0.438785 0.095364 0.176502 0.191147 0.173846 0.258188 0.183423 0.197818 0.218237 0.187063 0.191262 0.195661 0.203902 0.209740 0.208478 0.212907 0.211742 0.249650 0.275231 0.218622 0.304081 0.308648 0.376881
chargesum: 0.00000
title: Mulliken charges with hydrogens summed into heavy atoms:
elementType: O O O N C C C C C C C C C C C C C C
charge: -0.232408 -0.084003 -0.234105 -0.099070 0.007102 0.065958 0.026219 -0.011019 0.031041 0.096996 -0.064227 0.225818 0.149055 -0.067467 -0.242596 0.557502 -0.220163 0.095364
polarizability: 2.42438248e+02 -2.54523159e+00 1.84412773e+02 2.00334881e+01 -5.15589836e+00 1.09185496e+02
1716.lowfreq: -12.9016 -3.2608 -0.0009 -0.0007 -0.0004 7.7909 16.4985 19.4571 22.9808
frequency: 11.7717 19.4436 22.8519 38.3738 62.3228 69.3912 106.5267 118.8130 122.5488 125.3911 146.6853 174.7294 191.1246 222.4831 241.4274 248.1793 317.7499 320.0099 341.5968 347.0780 357.5620 372.0990 386.1442 421.6822 428.2097 470.6469 515.7401 541.4005 574.2479 591.4251 626.8011 696.4413 705.7810 722.7460 725.3050 751.0696 764.7733 798.6229 809.1087 865.3057 879.2438 904.5024 911.1543 914.4147 927.5074 932.3713 979.5012 988.9303 1002.1461 1038.4869 1043.9192 1059.8228 1077.7802 1086.7545 1118.8338 1122.6376 1146.0737 1165.7756 1192.9702 1210.8270 1227.9979 1242.4254 1254.7888 1269.3466 1279.4711 1281.7579 1287.2213 1293.1119 1305.7218 1334.9421 1338.4042 1354.7211 1363.1006 1369.8545 1387.8511 1394.0292 1433.2695 1449.7501 1463.5856 1466.2494 1470.2827 1475.1698 1475.8880 1484.2276 1489.0806 1504.2101 1578.7554 1628.0433 1640.8232 1656.4199 2940.6013 2946.0518 2954.1508 2960.0050 2965.2313 2970.2534 2974.8974 2987.3618 3002.0980 3003.1307 3026.8096 3032.6904 3056.2139 3066.6392 3068.3100 3123.8122 3165.1814 3169.6258 3529.8366 3573.8723 3714.1858
redmass: 1.8053 4.8496 3.5208 9.6173 3.3191 4.2221 2.1216 3.7308 2.9934 2.8296 2.7748 5.0069 4.8992 1.1381 2.2787 2.8133 3.5049 1.2496 1.1082 4.4178 6.4332 4.3933 5.0458 2.9186 2.8479 4.4607 3.4536 2.2217 3.7731 1.4208 5.2099 4.2066 5.9704 1.2044 1.4414 1.4220 3.9708 1.5104 1.6077 1.5122 2.1088 1.6907 1.9180 3.7700 1.7529 1.5497 3.5190 1.6125 2.9779 1.7291 1.6989 2.6815 2.3153 1.9458 1.8731 2.4357 1.6908 1.2958 1.5219 1.2951 2.8619 1.3330 1.2853 1.6112 1.8442 1.1915 1.1302 1.1837 1.1749 2.8983 1.4093 1.6428 1.4888 1.5641 1.2183 5.2619 3.9320 1.0838 1.0683 1.0727 1.1713 1.0689 1.0450 1.0787 1.0928 2.6781 7.4829 3.8819 1.4349 5.3393 1.0546 1.0592 1.0595 1.0656 1.0607 1.0363 1.0637 1.0944 1.1010 1.1040 1.0991 1.1012 1.1020 1.1005 1.0994 1.0896 1.0914 1.0933 1.0640 1.0449 1.1041
irintensity: 0.5392 0.4183 0.5990 0.9846 0.9077 1.3754 0.7961 0.2412 1.5479 1.8113 1.1989 1.7050 0.2585 0.0191 1.1285 0.5436 31.1579 209.7609 70.9955 3.7467 13.3165 1.9279 1.9872 0.6327 12.1871 1.5093 10.8789 4.4610 21.4876 142.8660 16.3140 9.2164 6.1083 19.3738 4.4308 5.4352 8.0858 5.9714 55.1417 7.0093 17.0022 22.4522 7.1836 28.5545 36.2322 30.3524 280.3847 20.6657 1.4847 9.9890 23.1703 3.3727 5.1926 6.9283 114.3366 14.2870 5.4395 90.8530 1.3374 9.2163 229.5104 3.7390 3.2997 24.5651 47.3421 6.4437 1.3702 0.2503 6.9361 59.4679 0.4931 0.9847 12.0842 6.1660 11.0162 27.1775 19.7976 8.4137 0.2846 0.5293 83.2566 2.1628 10.7669 1.3037 26.3004 234.1196 48.5738 135.8989 398.0731 21.9461 41.1947 15.3562 2.3474 11.7207 101.6649 39.7882 51.2104 12.5406 8.8155 44.7128 55.4682 8.8532 63.4912 98.8034 61.8708 24.3805 7.6178 10.6863 35.3004 75.3596 20.8206
temp: 298.150 k
press: 1.00000 atm
elementType: 8 8 8 7 6 6 6 6 6 6 6 6 6 6 6 6 6 6 1 1 1 1 1 1 1 1 1 1 1 1 1 1 1 1 1 1 1 1 1
symmnumber: 1
zpe: 858372.8 jmol-1
zpe.correction: 0.326937 hartree
zpe.thermalcorrener: 0.347102 hartree
zpe.thermalcorrenthalpy: 0.348046 hartree
zpe.thermalcorrgfe: 0.274574 hartree
zpe.sumelectzpe: -825.128854 hartree
zpe.sumelectthermal: -825.108690 hartree
zpe.sumelectthermalent: -825.107745 hartree
zpe.sumelectthermalfe: -825.181217 hartree
dipole: 3.4676 -2.1279 1.0236
dipole: 4.1953
quadrupole: -83.7251 -94.6859 -111.8634
quadrupole: 0.4992 6.6067 -1.2858
quadrupole: 13.0331 2.0722 -15.1052 0.4992 6.6067 -1.2858
hfenergy: -825.4557913 hartree
pointgroup: C01 [X(C14H21N1O3)]
dipole: -1.3850218 -0.7487022 -0.4954187 debye
polarizability: 242.6952371|-1.2676299|181.9467263|19.5725047|13.9809895|111.3945538 unknown
InChI: InChI=1S/C14H21NO3/c1-2-3-4-5-6-9-18-13-8-7-11(15)10-12(13)14(16)17/h7-8,10,16H,2-6,9,15H2,1H3
charge 0 multiplicity 1
39 atoms
O  -0.341788 -0.750838 0.309413
O  -2.077223 3.102999 0.856168
O  -0.074944 1.948668 0.7433
N  -5.770169 0.338587 -0.884655
C  3.988625 -0.884278 0.14153
C  2.512032 -0.954438 -0.305462
C  4.80616 0.169983 -0.638307
C  1.702119 -2.01262 0.475364
C  6.280774 0.261235 -0.184205
C  0.232945 -2.086219 0.050731
C  7.090055 1.314494 -0.971654
C  -1.675271 -0.518514 -0.023008
C  -2.188272 0.808879 0.150084
C  -2.54923 -1.529436 -0.499598
C  -3.554191 1.069214 -0.135174
C  -4.428131 0.058361 -0.605304
C  -3.896845 -1.249358 -0.78775
C  -1.320361 1.927624 0.596921
H  4.465818 -1.880611 0.020279
H  4.030469 -0.648071 1.225635
H  2.467185 -1.184333 -1.391482
H  2.02841 0.030689 -0.166644
H  4.771641 -0.066647 -1.722772
H  4.324156 1.162789 -0.522113
H  1.745872 -1.786559 1.558623
H  2.149292 -3.018866 0.335022
H  6.75951 -0.733679 -0.295396
H  6.313086 0.501813 0.898264
H  0.137292 -2.323874 -1.03023
H  -0.316846 -2.850806 0.638879
H  7.096436 1.080852 -2.053346
H  8.140526 1.360472 -0.629225
H  6.649904 2.322427 -0.850543
H  -2.181634 -2.548607 -0.645611
H  -3.919484 2.089378 0.01307
H  -4.545865 -2.053634 -1.155849
H  -6.395586 -0.386378 -1.221285
H  -6.143485 1.273093 -0.751487
H  -1.434382 3.81091 1.129419
