program: Gaussian 09
title: 000272763
version: EM64L-G09RevD.01
frameworkgroup: C1[X(C13H14BrNO3)]
method: RPBEPBE
basis: SDD
operation: Freq
keyword: #p
keyword: freq=noraman
keyword: PBEPBE/SDD
title: #p freq=noraman PBEPBE/SDD
converged: YES YES NO NO
title: Mulliken charges:
elementType: Br O O O N C C C C C C C C C C C C C H H H H H H H H H H H H H H
charge: -0.022200 -0.428743 -0.213453 -0.292227 -0.401857 -0.151412 -0.564957 0.521924 0.157149 -0.380763 -0.431262 0.296269 -0.253284 -0.226712 -0.245602 -0.325020 0.007587 -0.763371 0.293540 0.214032 0.260338 0.312309 0.261548 0.228238 0.231914 0.226004 0.229461 0.216720 0.391430 0.277601 0.295973 0.278828
chargesum: 0.00000
title: Mulliken charges with hydrogens summed into heavy atoms:
elementType: Br O O O N C C C C C C C C C C C C C
charge: -0.022200 -0.037313 -0.213453 -0.292227 -0.089548 0.142128 -0.090588 0.521924 0.157149 -0.119215 -0.203024 0.296269 -0.021370 -0.000708 -0.016141 -0.108301 0.285188 -0.188571
polarizability: 2.19561063e+02 1.39268784e+00 1.81249799e+02 -1.82472958e+01 -4.44626836e+00 1.33521438e+02
1716.lowfreq: -7.1658 0.0003 0.0004 0.0005 1.8947 3.8745 14.6260 25.6738 30.5221
frequency: 14.2235 25.6481 30.5192 35.6855 46.5261 67.4686 77.0655 98.3007 107.4665 153.1399 173.0484 206.9282 226.0220 245.4283 291.0603 315.4073 376.6429 377.3761 404.7006 422.5826 468.0159 528.6236 536.5981 547.9292 556.4846 597.2176 615.2629 621.0859 691.1405 695.3227 703.3783 721.4507 740.6732 800.7916 845.5877 854.1541 871.7144 878.7431 890.9126 926.7743 967.6078 977.2677 988.9738 990.6584 997.0790 1021.7600 1032.4662 1064.0326 1079.0505 1092.7015 1113.3721 1143.2108 1173.1381 1191.8079 1197.2844 1206.4436 1213.5471 1231.0014 1273.0010 1285.6905 1300.6593 1312.8368 1315.7831 1335.3031 1354.3362 1383.0194 1439.6680 1452.2158 1462.8665 1485.7143 1489.2963 1589.0006 1593.1876 1615.3588 1662.8956 1667.6668 2978.4557 3027.0294 3044.8636 3061.0256 3102.7948 3112.7755 3126.6283 3129.0584 3137.4734 3148.1738 3152.0092 3163.9352 3522.2679 3557.2394
redmass: 6.5459 5.7024 9.8351 4.9137 7.4473 4.8734 6.8053 6.4234 3.7571 5.3806 3.3510 4.5612 4.2367 4.3303 3.9912 3.0936 5.2130 3.7900 2.8183 3.5396 2.9683 3.9044 4.9638 2.8481 1.8295 1.8211 4.3889 2.3786 5.0109 3.9194 2.1296 4.4949 1.4832 4.7787 1.8696 1.2595 1.9344 2.8938 2.0235 1.5817 2.7509 1.4694 1.3320 3.3433 1.4227 2.8765 2.2468 1.8258 2.2649 1.6850 1.9967 1.9687 1.0588 1.3207 1.2452 1.2448 1.9696 1.5456 1.5256 1.3038 1.4942 1.4090 1.6056 1.6973 1.3088 5.7616 1.9965 1.1344 1.1831 1.9217 2.1360 6.3382 5.8722 5.9291 6.0306 9.2857 1.0593 1.0956 1.0889 1.0567 1.0931 1.0874 1.0862 1.0941 1.0913 1.0959 1.1073 1.1015 1.0642 1.0776
irintensity: 0.1360 1.1859 1.8833 1.6242 1.2283 0.5140 7.0708 2.4012 1.6500 2.5194 0.9618 5.8282 0.3935 14.6842 1.8508 7.1284 11.2289 23.0902 0.5009 4.8031 9.8135 29.9882 28.0620 14.5266 36.1492 192.0281 16.4177 59.8053 35.1640 29.5682 38.8528 4.4045 57.1461 9.7247 7.1749 1.0908 22.3293 33.9579 3.0597 6.5301 12.1845 0.0246 55.9593 4.1761 0.3166 8.3689 8.7975 7.4668 216.6454 8.5987 16.5207 5.1679 0.1384 19.7852 35.4199 24.6539 2.4725 70.5999 18.0797 32.2020 24.2522 0.9889 18.1112 84.1010 4.1617 0.7816 6.0294 6.3845 66.7698 186.2591 53.4181 109.1676 2.3043 8.2135 14.0979 268.8526 20.8356 11.8402 13.7327 12.2894 12.2929 8.7674 0.3121 0.2777 16.8442 28.2390 4.6088 22.3344 36.8417 34.0909
temp: 298.150 k
press: 1.00000 atm
elementType: 35 8 8 8 7 6 6 6 6 6 6 6 6 6 6 6 6 6 1 1 1 1 1 1 1 1 1 1 1 1 1 1
symmnumber: 1
zpe: 644492.5 jmol-1
zpe.correction: 0.245474 hartree
zpe.thermalcorrener: 0.263702 hartree
zpe.thermalcorrenthalpy: 0.264647 hartree
zpe.thermalcorrgfe: 0.193812 hartree
zpe.sumelectzpe: -796.350587 hartree
zpe.sumelectthermal: -796.332359 hartree
zpe.sumelectthermalent: -796.331415 hartree
zpe.sumelectthermalfe: -796.402250 hartree
dipole: 1.4176 -0.7902 -4.8069
dipole: 5.0735
quadrupole: -128.9322 -104.5795 -113.7627
quadrupole: -0.4103 -5.6067 -8.4571
quadrupole: -13.1741 11.1786 1.9955 -0.4103 -5.6067 -8.4571
hfenergy: -796.5960617 hartree
pointgroup: C01 [X(C13H14Br1N1O3)]
dipole: -0.356267 -0.3792287 1.9270466 debye
polarizability: 214.4078073|-0.9238329|180.818873|-27.1248423|7.2836351|139.1056203 unknown
InChI: InChI=1S/C13H14BrNO3/c14-8-4-7-12(16)15-11(13(17)18)9-10-5-2-1-3-6-10/h1-7,11,15,17H,8-9H2
charge 0 multiplicity 1
32 atoms
Br 6.375282 -0.37068 -0.628202
O  0.104813 3.491571 1.157363
O  -1.547447 3.912185 -0.423312
O  1.04399 0.158026 -1.722259
N  0.451732 0.957788 0.388643
C  -0.779202 1.589418 -0.079396
C  -2.073271 1.003386 0.576538
C  -2.252188 -0.502377 0.414966
C  -0.792334 3.102493 0.15045
C  -1.892229 -1.186378 -0.774754
C  -2.856944 -1.24041 1.464823
C  1.309081 0.295778 -0.484803
C  -2.142229 -2.570273 -0.910302
C  -3.110342 -2.623891 1.330289
C  -2.754856 -3.294835 0.137853
C  2.550525 -0.235835 0.152585
C  3.493687 -0.881874 -0.588014
C  4.73695 -1.465523 -0.016059
H  -0.81418 1.428147 -1.172165
H  -2.079086 1.262841 1.653435
H  -2.929659 1.537921 0.119116
H  0.737538 1.122398 1.355349
H  -1.395214 -0.654755 -1.593913
H  -3.136205 -0.727141 2.393958
H  -1.852941 -3.081846 -1.835038
H  -3.581303 -3.174764 2.152394
H  -2.948376 -4.367812 0.028821
H  2.686611 -0.094346 1.234227
H  0.044064 4.475703 1.29328
H  3.320577 -0.98402 -1.667509
H  4.96154 -2.471926 -0.399081
H  4.780818 -1.437166 1.082219
