program: Gaussian 09
title: 000272762
version: EM64L-G09RevD.01
frameworkgroup: C1[X(C13H13NO4)]
method: RPBEPBE
basis: SDD
operation: Freq
keyword: #p
keyword: freq=noraman
keyword: PBEPBE/SDD
title: #p freq=noraman PBEPBE/SDD
converged: YES YES NO NO
title: Mulliken charges:
elementType: O O O O N C C C C C C C C C C C C C H H H H H H H H H H H H H
charge: -0.270917 -0.198147 -0.198917 -0.246367 -0.213729 0.184543 0.182618 -0.487901 0.111841 0.109836 0.037296 -0.353761 -0.352981 0.300511 -0.210877 -0.210755 -0.684555 -0.677194 0.278147 0.280975 0.236839 0.269855 0.269998 0.239428 0.239484 0.210325 0.237449 0.223492 0.213557 0.254477 0.225430
chargesum: 0.00000
title: Mulliken charges with hydrogens summed into heavy atoms:
elementType: O O O O N C C C C C C C C C C C C C
charge: -0.270917 -0.198147 -0.198917 -0.246367 -0.213729 0.184543 0.182618 0.071221 0.111841 0.109836 0.274135 -0.083906 -0.082983 0.300511 0.028551 0.028729 -0.013290 0.016270
polarizability: 1.84718729e+02 -3.40072227e+01 1.30215009e+02 1.08417574e+01 1.03202858e+01 1.54038461e+02
1716.lowfreq: -14.7927 -8.6871 -1.2394 -0.0006 0.0004 0.0008 1.2629 25.5641 31.9603
frequency: -13.7965 25.2629 31.9210 63.7437 95.3525 97.8441 138.2803 163.1421 184.4926 188.9359 218.0021 241.9970 246.1561 270.0129 315.4092 348.8305 368.4792 389.1528 414.9809 448.3564 455.6489 523.0650 545.1606 548.5364 597.7463 619.5476 658.9357 681.9407 703.4706 723.6322 781.8774 785.8263 798.8281 828.3458 865.4245 907.7882 919.5735 929.3854 936.0142 942.4755 975.5895 976.0716 1006.9827 1019.8589 1072.6694 1097.1975 1099.7594 1158.2442 1169.4414 1172.7292 1177.4440 1196.9537 1211.9674 1284.2064 1307.0517 1323.9761 1331.2081 1334.6370 1365.5967 1382.8771 1399.7665 1412.8723 1418.8083 1454.2729 1455.3051 1456.8651 1465.1935 1472.5416 1487.7982 1614.5863 1619.7299 1633.9695 1635.6440 1683.0090 2991.7414 2994.5892 3027.7111 3029.5682 3087.3952 3091.1659 3094.8341 3100.3948 3106.7915 3139.6447 3153.0637 3164.6488 3174.6264
redmass: 5.2773 4.2427 4.9536 4.0023 6.8837 4.2545 4.9895 4.4205 1.7170 1.6915 2.4909 1.2093 4.8838 4.6165 10.8357 4.2698 4.4179 3.4863 3.2094 2.5510 4.8719 7.0275 3.9080 7.3513 4.9395 7.4257 4.8447 6.8940 5.1274 3.0357 4.0291 5.3535 1.8356 4.6100 3.6750 1.3906 3.6720 1.2417 3.4919 1.3877 1.4119 5.8879 1.3459 2.0061 2.5859 2.2385 2.1504 2.0641 1.1808 2.0198 2.6481 2.9449 3.3168 1.4788 1.3552 1.3795 1.4400 1.4266 5.5058 1.2554 1.2287 1.5810 2.3003 2.4732 2.7864 1.0560 1.0476 1.0499 1.0487 7.6741 7.8018 12.0539 11.2995 12.0036 1.0356 1.0360 1.0591 1.0868 1.0994 1.1024 1.0987 1.1008 1.1008 1.0864 1.0906 1.0956 1.1004
irintensity: 0.0235 0.9173 0.5872 2.4448 4.8788 0.1199 0.0057 5.0002 0.1471 0.6451 4.1482 0.5648 3.0016 4.7879 10.7762 3.0192 2.4285 7.0808 0.6383 3.4575 0.0025 6.4216 4.5029 9.7492 6.2961 26.5771 0.0043 0.1439 21.4277 64.4683 26.2196 0.0565 18.8545 0.4236 15.1962 0.0273 62.8797 2.0501 65.3669 3.9211 2.0428 14.1721 0.0022 0.7905 17.9004 67.6376 73.6066 13.5578 12.5520 5.4742 151.9066 109.1214 50.2294 0.0199 16.2118 10.4381 35.7038 2.8448 255.2225 32.9259 16.4875 13.2528 31.0544 11.7696 0.6751 6.5031 6.5068 7.2446 24.6089 2.0259 58.3542 391.3296 262.5146 47.0638 12.3481 17.0169 9.5724 6.6073 1.3878 0.8900 55.8393 16.8555 25.0787 1.6858 5.1591 5.7516 19.8519
temp: 298.150 k
press: 1.00000 atm
elementType: 8 8 8 8 7 6 6 6 6 6 6 6 6 6 6 6 6 6 1 1 1 1 1 1 1 1 1 1 1 1 1
symmnumber: 1
zpe: 622264.9 jmol-1
zpe.correction: 0.237008 hartree
zpe.thermalcorrener: 0.253029 hartree
zpe.thermalcorrenthalpy: 0.253974 hartree
zpe.thermalcorrgfe: 0.192393 hartree
zpe.sumelectzpe: -857.566777 hartree
zpe.sumelectthermal: -857.550755 hartree
zpe.sumelectthermalent: -857.549811 hartree
zpe.sumelectthermalfe: -857.611392 hartree
dipole: -3.2542 3.5835 -0.5417
dipole: 4.8708
quadrupole: -91.8255 -100.7567 -111.8319
quadrupole: 3.0152 -1.3379 -3.3137
quadrupole: 9.6459 0.7147 -10.3605 3.0152 -1.3379 -3.3137
hfenergy: -857.8037848 hartree
pointgroup: C01 [X(C13H13N1O4)]
dipole: 1.331182 -1.1974392 -0.6829383 debye
polarizability: 187.0327843|-26.2263671|137.6395485|-21.1491808|-16.5425479|144.2998654 unknown
InChI: InChI=1S/C13H13NO4/c1-8(2)18-11(15)7-14-12(16)9-5-3-4-6-10(9)13(14)17/h3-6,8H,7H2,1-2H3
charge 0 multiplicity 1
31 atoms
O  -2.099275 -0.30043 -0.296572
O  0.152605 -0.453157 2.529411
O  0.3878 2.243721 -1.320907
O  -3.703656 1.133505 0.61738
N  -0.016359 1.053611 0.697747
C  1.879544 -0.29398 0.735551
C  1.949697 0.517598 -0.423669
C  -1.329526 1.599591 0.999935
C  0.612378 0.028986 1.466153
C  0.729852 1.385216 -0.472188
C  -3.183053 -1.176472 -0.893937
C  2.891215 -1.214913 1.045668
C  3.032815 0.43486 -1.31088
C  -2.512055 0.799822 0.430966
C  3.991166 -1.307621 0.153239
C  4.060924 -0.495377 -1.007022
C  -2.527212 -1.857965 -2.095379
C  -3.678726 -2.142686 0.189962
H  -1.461751 1.648542 2.094833
H  -1.395741 2.623845 0.592837
H  -3.999955 -0.499312 -1.206032
H  2.827288 -1.835694 1.944802
H  3.075828 1.067437 -2.202984
H  4.799863 -2.016216 0.361758
H  4.922275 -0.589559 -1.676902
H  -3.267475 -2.494359 -2.613083
H  -2.146333 -1.110865 -2.812246
H  -1.685718 -2.495454 -1.771683
H  -4.446957 -2.815852 -0.232507
H  -4.130005 -1.591496 1.031644
H  -2.84545 -2.759126 0.570403
