program: Gaussian 09
title: 000272747
version: EM64L-G09RevD.01
frameworkgroup: C1[X(C10H12O3)]
method: RPBEPBE
basis: SDD
operation: Freq
keyword: #pfreq=noraman
keyword: PBEPBE/SDD
title: #p freq=noraman PBEPBE/SDD
converged: YES YES NO NO
title: Mulliken charges:
elementType: O O O C C C C C C C C C C H H H H H H H H H H H H
charge: -0.284045 -0.416072 -0.209005 -0.180704 0.391463 -0.362000 -0.395830 -0.221955 0.155233 -0.221723 -0.224691 -0.237631 -0.680696 0.236386 0.273345 0.242961 0.185437 0.221772 0.226607 0.225984 0.228209 0.205173 0.234516 0.228220 0.379045
chargesum: 0.00000
title: Mulliken charges with hydrogens summed into heavy atoms:
elementType: O O O C C C C C C C C C C
charge: -0.284045 -0.037027 -0.209005 0.055682 0.391463 -0.088655 -0.152869 0.185253 0.155233 0.004884 0.001293 -0.009422 -0.012787
polarizability: 1.46816811e+02 2.49641307e+00 1.07349576e+02 5.02347864e+00 -1.82642753e+01 8.95385012e+01
1716.lowfreq: -6.5803 -4.5785 -0.0009 -0.0005 0.0004 5.6926 23.3830 49.3525 60.8168
frequency: 23.3584 49.3504 60.7879 76.7929 91.0467 116.7698 210.5511 236.7425 260.2922 282.8238 306.8262 347.9206 401.8810 470.9946 496.6386 550.1975 611.1123 618.5833 630.6662 687.9004 702.7819 752.3046 819.4440 840.6811 852.1779 855.2752 881.1191 934.2870 980.5327 990.2170 998.8626 1008.4455 1024.2611 1028.1379 1069.7986 1092.2474 1116.4269 1137.5640 1172.5478 1185.1967 1195.0425 1227.2007 1259.8090 1271.1016 1309.1815 1329.3691 1378.7655 1387.3652 1397.1964 1439.4714 1459.7635 1478.6057 1481.3547 1489.8363 1595.9912 1611.7942 1670.0118 2937.3340 2957.2192 2995.8192 3006.5269 3093.3926 3104.5481 3123.6241 3131.9378 3144.9565 3160.7784 3176.6484 3509.1967
redmass: 3.9317 8.9743 2.2832 3.5675 3.3588 4.3130 2.7982 1.7625 2.7565 5.5143 4.5523 4.9237 2.8260 3.5482 3.1523 2.7464 4.4733 2.1323 4.9366 4.2174 1.8920 1.8703 1.1184 3.5157 3.4320 1.2500 3.3943 1.5347 1.4064 5.8284 1.3243 3.3740 2.5866 2.2999 2.8199 2.1640 2.1707 1.4667 1.0572 1.1526 1.8871 1.5559 1.1980 1.5525 1.4665 1.2763 1.4986 4.2424 1.3258 2.1895 1.0404 1.0613 2.2604 1.0760 6.2834 6.0562 8.9661 1.0601 1.0828 1.0359 1.1019 1.0989 1.1013 1.0850 1.0888 1.0939 1.0987 1.0967 1.0641
irintensity: 0.2932 0.8377 0.1976 3.4649 2.7169 1.4287 0.4565 0.1010 2.5359 0.5593 2.6794 5.3798 0.4739 2.0603 24.0710 36.7930 22.6359 89.9439 29.4815 26.6644 51.3965 55.7005 3.3115 5.7792 3.0428 0.3232 8.0365 1.5937 2.5450 1.6814 0.6274 191.5208 104.6986 44.1274 86.5212 64.0148 4.9405 7.5579 0.3736 4.2095 2.6709 1.0725 5.9809 14.4820 27.4647 2.7200 0.2136 0.9695 27.5421 9.6276 12.0851 8.2674 17.1378 5.3020 1.3583 6.4588 199.9917 59.0795 31.2355 23.2691 31.5079 33.2384 33.4521 1.0055 4.9998 30.7083 27.1313 6.1413 22.5193
temp: 298.150 k
press: 1.00000 atm
elementType: 8 8 8 6 6 6 6 6 6 6 6 6 6 1 1 1 1 1 1 1 1 1 1 1 1
symmnumber: 1
zpe: 522154.3 jmol-1
zpe.correction: 0.198878 hartree
zpe.thermalcorrener: 0.211831 hartree
zpe.thermalcorrenthalpy: 0.212776 hartree
zpe.thermalcorrgfe: 0.157576 hartree
zpe.sumelectzpe: -612.951692 hartree
zpe.sumelectthermal: -612.938739 hartree
zpe.sumelectthermalent: -612.937795 hartree
zpe.sumelectthermalfe: -612.992994 hartree
dipole: 0.1724 1.2602 -1.5273
dipole: 1.9876
quadrupole: -66.1399 -69.5542 -79.6331
quadrupole: 0.1157 -4.1576 -3.4824
quadrupole: 5.6358 2.2216 -7.8574 0.1157 -4.1576 -3.4824
hfenergy: -613.1505701 hartree
pointgroup: C01 [X(C10H12O3)]
dipole: 0.1237244 -0.4777941 0.6065703 debye
dipolederiv: -1.1047685 -0.3378119 -0.0612223 -0.3403781 -0.5628191 -0.0830708 -0.0604544 -0.0388166 -0.3678007 -0.4097228 -0.067213 0.003593 -0.0616363 -1.1017622 0.3716626 0.0027525 0.3216231 -0.4028743 -0.4639868 -0.0675884 0.2294707 0.105438 -0.6051076 -0.1079553 0.4223437 0.0698477 -0.7799298 0.3871986 0.296656 0.1383476 0.5032336 0.450911 0.0350385 0.0074989 -0.0636447 0.3010103 0.247993 -0.1400193 -0.0470658 -0.0761499 -0.0996385 -0.0539329 0.0533586 -0.0628799 -0.0601799 -0.0801377 0.0852283 -0.0414982 0.0837273 -0.0708628 -0.0479443 0.0108569 -0.0490246 -0.0793172 -0.1033662 -0.0326384 0.0439464 -0.000123 -0.0302605 -0.1095631 -0.0153459 -0.0944322 -0.0714907 0.8984652 0.213492 0.0780417 0.0637605 0.2786208 0.0182644 0.1171413 0.0891423 0.4126335 0.3455842 0.0363539 -0.4034767 -0.2651644 1.3778255 -0.1424942 -0.5894607 -0.2247285 0.9302665 -0.0462744 -0.053245 0.0594994 -0.0621199 0.0036754 -0.1399094 0.0282172 -0.1304761 -0.0163765 0.0054607 0.0717334 -0.0741653 0.0791115 -0.0547857 -0.0925195 -0.0758126 -0.0833857 -0.05507 0.0793954 -0.0167293 0.0269686 -0.0278844 -0.1030435 -0.0618772 0.0325929 -0.0590611 -0.1028428 -0.0406642 -0.0954092 0.0010523 -0.0870498 -0.0720459 0.0210224 -0.0012899 0.0152357 0.0490379 0.000985 -0.0021812 -0.0352998 -0.0509058 -0.0235962 0.0518122 -0.0132918 0.0675665 -0.104392 0.0883563 -0.0513227 0.0562571 -0.0526653 0.0852219 0.0569384 0.0820926 0.0516661 0.0962078 0.0784668 0.0476917 -0.0599557 0.0402987 0.031548 0.1055289 -0.045179 0.1015301 0.0496264 -0.0622352 -0.0505558 0.00112 0.0248423 0.0097883 0.1020514 -0.1029392 0.0742129 -0.1830981 -0.0733948 0.0200704 0.019087 0.1073997 -0.0645293 -0.073628 0.0630582 -0.0969654 -0.0122278 0.0462825 0.043934 -0.037781 0.0526672 0.0158981 0.1302423 -0.0576518 0.1311263 0.0324542 -0.0332534 -0.0699218 0.0719238 -0.0849588 0.0615535 0.0950172 0.0775316 0.0939537 0.0666945 -0.1339991 0.0351955 -0.0324432 0.0383607 0.1154202 0.0395276 -0.0304493 0.0387461 0.1218208 -0.1835628 -0.0351121 -0.0436123 -0.009623 0.0729729 0.0051765 -0.0485859 0.0023054 0.1036258 0.1201296 0.0321803 -0.0503049 -0.0076301 0.0589302 0.0436738 -0.019007 0.0768173 -0.1094401 0.0778375 0.0963387 0.0740617 0.031022 -0.0352701 -0.0809401 0.065735 -0.098117 0.0035032 0.3592112 0.0408738 0.083456 -0.0035728 0.2613554 -0.0821214 0.0962879 -0.1322416 0.1781589 unknown
polarizability: 146.8572307|1.5086711|106.755439|-3.4930502|-18.9343633|90.0922183 unknown
InChI: InChI=1S/C10H12O3/c1-2-13-9(10(11)12)8-6-4-3-5-7-8/h3-7,9,11H,2H2,1H3
charge 0 multiplicity 1
25 atoms
O  1.519622 0.955477 0.188638
O  0.978052 -2.654393 0.218251
O  1.749123 -1.356628 -1.553714
C  0.795419 -0.263218 0.49307
C  -0.697102 -0.008035 0.274192
C  -1.117755 0.966091 -0.662722
C  -1.659787 -0.761525 0.987862
C  2.970229 0.880537 0.4658
C  1.240972 -1.43126 -0.418883
C  -2.496621 1.186987 -0.87686
C  -3.037684 -0.540125 0.769013
C  -3.459861 0.435332 -0.164318
C  3.541139 2.275939 0.222838
H  0.972542 -0.588593 1.540664
H  -0.362265 1.54818 -1.19773
H  -1.333777 -1.523127 1.705955
H  3.127571 0.559282 1.519297
H  3.439253 0.136423 -0.209504
H  -2.818824 1.945526 -1.599076
H  -3.778324 -1.123801 1.327001
H  -4.528729 0.60874 -0.332768
H  4.630752 2.281531 0.408055
H  3.362836 2.58586 -0.820985
H  3.065562 3.013615 0.891574
H  1.196057 -3.405813 -0.39775
