program: Gaussian 09
title: 000272751
version: EM64L-G09RevD.01
frameworkgroup: C1[X(C11H10Cl3NO3)]
method: RPBEPBE
basis: SDD
operation: Freq
keyword: #p
keyword: freq=noraman
keyword: PBEPBE/SDD
title: #p freq=noraman PBEPBE/SDD
converged: YES YES NO NO
title: Mulliken charges:
elementType: Cl Cl Cl O O O N C C C C C C C C C C C H H H H H H H H H H
charge: 0.057320 0.145220 0.118347 -0.402723 -0.223799 -0.195694 -0.382907 -0.140783 -0.599214 0.522634 0.158571 -0.387000 -0.396373 0.476266 -0.219309 -0.229692 -0.232243 -0.733758 0.310189 0.249386 0.220875 0.346069 0.229979 0.234443 0.225641 0.227748 0.229177 0.391631
chargesum: 0.00000
title: Mulliken charges with hydrogens summed into heavy atoms:
elementType: Cl Cl Cl O O O N C C C C C C C C C C C
charge: 0.057320 0.145220 0.118347 -0.011092 -0.223799 -0.195694 -0.036838 0.169406 -0.128953 0.522634 0.158571 -0.157021 -0.161930 0.476266 0.006331 -0.001944 -0.003067 -0.733758
polarizability: 1.45745419e+02 5.24659332e+00 1.90516144e+02 1.99294437e+01 5.47791778e+00 1.36630165e+02
1716.lowfreq: -3.6753 -0.0010 -0.0005 0.0013 3.4445 7.5169 9.8189 23.1021 36.8910
frequency: 7.9602 23.0426 36.8818 42.8453 49.1851 61.7343 87.8031 99.4832 133.0343 166.9214 191.7587 223.4736 249.7780 251.7165 266.1012 298.6528 330.3338 338.7454 373.0345 402.8094 404.0952 480.5849 495.0291 561.4165 584.1933 609.4193 617.5169 620.2620 641.4762 688.2040 696.5565 703.9035 726.2032 761.4805 763.3147 812.6197 851.5189 875.8401 896.7784 930.7280 969.5040 975.7678 990.5849 993.3927 997.1216 1027.3187 1048.0308 1082.1393 1112.7226 1174.1147 1189.3220 1192.0283 1218.5005 1227.1939 1236.2878 1302.1971 1313.5015 1332.3972 1347.3239 1386.0782 1443.4347 1469.8294 1485.1858 1496.5619 1596.2038 1615.4876 1635.5403 1657.8406 2999.6841 3053.4574 3069.4421 3117.1917 3119.0412 3134.8571 3148.0978 3165.5987 3498.8772 3515.0428
redmass: 18.7517 6.9531 6.9991 6.8281 7.5047 5.2480 6.1444 8.2031 7.3090 14.5316 15.6265 7.9663 13.7291 10.9022 9.2459 8.0045 3.5026 5.6630 23.3305 2.9654 2.9940 3.6374 4.1496 4.6440 1.6305 2.1427 6.2012 6.6225 1.5278 4.3332 6.4989 1.7800 8.3956 2.6709 4.3812 4.6623 1.2532 2.1832 2.9821 1.9970 4.3313 1.3937 5.9175 2.5384 1.4173 2.1943 3.1597 1.7843 2.1354 1.0560 1.1221 1.4770 2.5129 1.4897 1.7383 1.5040 1.2768 1.2853 1.9630 7.5499 2.1742 1.1419 2.3209 1.6996 6.0666 6.1939 11.5765 8.8181 1.0603 1.0876 1.0994 1.0880 1.0871 1.0905 1.0957 1.1015 1.0777 1.0643
irintensity: 0.0174 0.0386 1.4963 0.8218 1.4742 1.0473 0.5555 0.1431 0.0744 4.2537 2.1721 2.3401 2.1961 4.7768 1.1700 3.0133 0.9831 3.2303 6.7627 6.9726 7.5533 41.7382 46.4051 2.6649 58.8931 73.7276 0.2733 102.4901 179.6769 26.0485 33.0617 44.5580 104.9738 83.4080 56.3319 5.0634 0.3783 5.3627 3.0582 3.6331 2.0230 0.0848 0.8361 6.9477 0.5458 6.6592 255.4434 26.9768 10.7388 0.0193 0.9160 5.5274 3.1730 12.9648 23.9553 14.7895 16.8097 14.0032 114.9518 0.5508 7.7533 48.8077 12.2685 173.4099 2.3179 1.7371 187.2475 174.2235 21.6723 2.7950 10.8518 6.4175 7.4701 8.8165 35.9972 20.0919 62.5784 38.0313
temp: 298.150 k
press: 1.00000 atm
elementType: 17 17 17 8 8 8 7 6 6 6 6 6 6 6 6 6 6 6 1 1 1 1 1 1 1 1 1 1
symmnumber: 1
zpe: 506578.6 jmol-1
zpe.correction: 0.192946 hartree
zpe.thermalcorrener: 0.211228 hartree
zpe.thermalcorrenthalpy: 0.212172 hartree
zpe.thermalcorrgfe: 0.141699 hartree
zpe.sumelectzpe: -2084.452865 hartree
zpe.sumelectthermal: -2084.434583 hartree
zpe.sumelectthermalent: -2084.433639 hartree
zpe.sumelectthermalfe: -2084.504111 hartree
dipole: -3.1227 2.0289 1.2994
dipole: 3.9441
quadrupole: -125.1022 -110.4828 -127.3301
quadrupole: -5.5896 2.9680 -4.4928
quadrupole: -4.1305 10.4889 -6.3584 -5.5896 2.9680 -4.4928
hfenergy: -2084.6458104 hartree
pointgroup: C01 [X(C11H10Cl3N1O3)]
dipole: 0.7688627 1.1888646 -0.6350798 debye
polarizability: 155.5111455|-17.9031907|176.587787|25.1120369|-3.4287711|140.7927955 unknown
InChI: InChI=1S/C11H10Cl3NO3/c12-11(13,14)10(18)15-8(9(16)17)6-7-4-2-1-3-5-7/h1-5,8,15-16H,6H2
charge 0 multiplicity 1
28 atoms
Cl -2.417146 -1.865709 -1.744935
Cl -1.311312 -3.390932 0.62261
Cl -3.712728 -1.578299 0.987644
O  -0.496996 3.985827 -0.046832
O  -1.911108 2.78968 -1.45578
O  -0.632874 -0.60629 1.68431
N  -1.021307 0.398227 -0.386786
C  -0.22826 1.59511 -0.095101
C  1.196151 1.56116 -0.769561
C  2.034877 0.386354 -0.297402
C  -0.993428 2.812158 -0.60668
C  2.830342 0.493043 0.871469
C  2.018918 -0.843203 -1.003032
C  -1.151747 -0.605379 0.537375
C  3.590219 -0.605421 1.328019
C  2.776175 -1.945797 -0.547724
C  3.563807 -1.829638 0.62003
C  -2.07871 -1.794069 0.117194
H  -0.097828 1.66175 0.998935
H  1.687827 2.520416 -0.525806
H  1.054369 1.523904 -1.866441
H  -1.534912 0.366263 -1.273738
H  2.853023 1.438762 1.427638
H  1.415501 -0.93697 -1.914403
H  4.19936 -0.509369 2.233644
H  2.751869 -2.890736 -1.101691
H  4.150857 -2.683635 0.975687
H  -0.979342 4.772491 -0.420844
