program: Gaussian 09
title: 000026234
version: EM64L-G09RevD.01
frameworkgroup: C1[X(C9H13ClN4OS2)]
method: RPBEPBE
basis: SDD
operation: Freq
keyword: #p
keyword: freq=noraman
keyword: PBEPBE/SDD
title: #p freq=noraman PBEPBE/SDD
converged: YES YES NO NO
title: Mulliken charges:
elementType: Cl S S O N N N N C C C C C C C C C H H H H H H H H H H H H H
charge: 0.016663 0.337376 0.089589 -0.194263 0.100632 -0.029621 0.106088 0.079743 -0.370561 -0.351504 -0.629359 -0.639884 -0.574090 -0.285778 0.068507 -0.291950 -0.500729 0.257201 0.216180 0.259393 0.229476 0.216067 0.256784 0.218522 0.217201 0.236755 0.224511 0.250366 0.244754 0.241931
chargesum: 0.00000
title: Mulliken charges with hydrogens summed into heavy atoms:
elementType: Cl S S O N N N N C C C C C C C C C
charge: 0.016663 0.337376 0.089589 -0.194263 0.100632 -0.029621 0.106088 0.079743 0.102820 0.137365 0.062014 0.038583 -0.574090 -0.285778 0.068507 -0.291950 0.236321
polarizability: 2.36515940e+02 -1.03695410e+01 1.78629301e+02 8.72012471e+00 5.07619812e+00 1.45954602e+02
1716.lowfreq: -6.2378 -0.0019 -0.0009 0.0016 5.5258 9.3334 22.2062 30.3790 39.1015
frequency: 22.0727 30.3002 39.0568 69.5786 70.2783 87.6715 96.6084 124.3035 128.4323 144.6437 160.3434 171.9314 195.7480 207.5664 223.5473 224.5716 266.3372 286.2831 304.0518 330.2440 353.2578 392.6680 416.8519 432.4459 498.3627 514.6069 536.3824 586.6554 609.4811 617.8951 669.4653 756.8923 770.9189 784.8498 785.6520 802.5299 850.1633 885.3120 907.4216 950.7435 1000.7620 1011.1419 1061.7208 1077.2177 1095.1836 1114.3168 1144.6930 1151.2953 1182.3136 1191.0589 1193.8901 1240.2952 1272.9425 1288.7018 1333.1608 1349.1905 1355.1730 1388.9689 1390.9187 1403.3805 1433.1155 1437.7243 1453.0417 1459.2331 1462.4718 1465.4169 1469.4626 1472.0756 1479.3837 1482.9044 1508.6314 2988.2842 2994.5152 3009.9761 3012.2404 3026.3076 3072.5798 3081.1729 3092.2230 3093.8904 3109.5005 3114.3103 3119.5564 3157.4449
redmass: 6.1937 7.5351 4.0756 5.9814 2.9021 2.8389 3.7171 1.6057 2.9783 4.6909 3.6122 7.3690 1.2844 3.0129 3.6469 1.3626 7.1941 4.4417 3.3926 4.1849 5.6401 13.0043 4.5481 4.7859 5.5125 7.7115 3.7195 5.3363 9.1595 9.7169 12.1746 2.2870 1.2735 2.9662 12.6540 1.9365 8.7646 13.3364 3.0745 2.4897 9.0387 2.8671 2.4106 1.8689 1.9053 1.2527 1.6303 1.8928 2.8131 5.6238 8.9906 10.7452 1.2983 1.2131 1.2695 1.2717 3.2197 1.2131 1.2119 8.2129 3.0259 1.6476 1.0500 1.0749 1.1165 1.0449 1.0673 2.2755 1.0704 1.0795 1.5919 1.0356 1.0356 1.0604 1.0291 1.0670 1.1024 1.0992 1.1003 1.0983 1.1013 1.0989 1.1051 1.1056
irintensity: 1.7353 1.7861 0.7821 0.5072 0.3914 0.7960 4.4446 0.0233 0.2216 0.4235 2.6613 0.3769 0.1332 2.2423 2.1685 1.7177 1.6474 0.8149 14.1641 15.1357 3.7526 4.6216 9.8299 8.0702 7.8371 2.4494 8.5143 1.5631 0.7700 0.4768 3.6548 33.0810 43.9349 93.8922 7.8728 43.0999 60.6473 0.4265 64.1667 49.9557 179.1320 16.3125 15.7346 16.8760 13.1320 0.0583 64.4233 16.4048 108.8857 39.2446 199.9124 126.3634 62.8164 8.2300 10.6444 16.1879 234.3062 3.5249 59.7070 514.7085 389.3765 122.0645 17.2913 67.2175 18.9754 12.5078 6.8198 685.5171 8.5190 19.9541 99.3766 24.4510 19.2240 38.4093 32.0461 16.1971 1.9864 12.9083 33.8604 27.3631 15.9463 28.0817 19.3220 20.2041
temp: 298.150 k
press: 1.00000 atm
elementType: 17 16 16 8 7 7 7 7 6 6 6 6 6 6 6 6 6 1 1 1 1 1 1 1 1 1 1 1 1 1
symmnumber: 1
zpe: 577484.8 jmol-1
zpe.correction: 0.219952 hartree
zpe.thermalcorrener: 0.239168 hartree
zpe.thermalcorrenthalpy: 0.240112 hartree
zpe.thermalcorrgfe: 0.169875 hartree
zpe.sumelectzpe: -1899.845310 hartree
zpe.sumelectthermal: -1899.826094 hartree
zpe.sumelectthermalent: -1899.825150 hartree
zpe.sumelectthermalfe: -1899.895387 hartree
dipole: -1.8015 -1.6933 4.0019
dipole: 4.7041
quadrupole: -107.0623 -126.5095 -122.8251
quadrupole: -18.8104 -8.9656 -3.8961
quadrupole: 11.7366 -7.7106 -4.0261 -18.8104 -8.9656 -3.8961
hfenergy: -1900.065262 hartree
pointgroup: C01 [X(C9H13Cl1N4O1S2)]
dipole: 0.8064452 0.7378347 1.4934545 debye
polarizability: 235.2136731|-10.0462118|177.8262777|-14.7123296|-5.7222163|148.0598918 unknown
InChI: InChI=1S/C9H13ClN4OS2/c1-4-14(5-2)9(16)17-8-12-6(10)11-7(13-8)15-3/h4-5H2,1-3H3
charge 0 multiplicity 1
30 atoms
Cl -0.897439 -3.335949 0.135116
S  0.496837 1.89687 -0.281888
S  2.198051 0.852039 -2.632603
O  -4.282635 0.333377 0.185777
N  2.760606 0.281366 -0.00891
N  -2.038637 1.021082 -0.027546
N  -0.33888 -0.710863 -0.046003
N  -2.679644 -1.32126 0.139076
C  3.948131 -0.517288 -0.439544
C  2.504453 0.301961 1.458965
C  3.568754 -1.978955 -0.751154
C  3.221777 1.471378 2.162042
C  1.976571 0.861393 -0.955045
C  -0.7418 0.598853 -0.101699
C  -2.95978 0.025052 0.097249
C  -1.365078 -1.589611 0.065958
C  -4.649637 1.771939 0.128166
H  4.373615 -0.033341 -1.335377
H  4.689948 -0.464589 0.378156
H  1.419596 0.342472 1.635501
H  2.858147 -0.666513 1.855962
H  3.109846 -2.473559 0.123291
H  2.850942 -2.017693 -1.586842
H  4.472969 -2.545447 -1.038048
H  4.310116 1.451496 1.971995
H  2.825652 2.439905 1.811113
H  3.064252 1.407538 3.253997
H  -4.312724 2.21265 -0.82402
H  -4.188925 2.317008 0.96801
H  -5.745382 1.768187 0.204706
