program: Gaussian 09
title: 000272730
version: EM64L-G09RevD.01
frameworkgroup: C1[X(C9H9NO3)]
method: RPBEPBE
basis: SDD
operation: Freq
keyword: #pfreq=noraman
keyword: PBEPBE/SDD
title: #p freq=noraman PBEPBE/SDD
converged: YES YES NO YES
title: Mulliken charges:
elementType: O O O N C C C C C C C C C H H H H H H H H H
charge: -0.206139 -0.261607 -0.203910 -0.601236 0.483829 -0.448667 -0.378024 -0.378005 -0.222033 -0.222034 -0.227900 0.194442 0.127191 0.241006 0.241010 0.233485 0.233484 0.230317 0.230316 0.232304 0.345655 0.356515
chargesum: 0.00000
title: Mulliken charges with hydrogens summed into heavy atoms:
elementType: O O O N C C C C C C C C C
charge: -0.206139 -0.261607 -0.203910 0.100934 0.483829 0.033349 -0.144539 -0.144520 0.008284 0.008282 0.004404 0.194442 0.127191
polarizability: 1.56152457e+02 2.25099893e+01 8.39692823e+01 -1.27580738e-02 -1.57306021e-03 9.23530669e+01
1716.lowfreq: -5.4885 -3.1125 -0.0012 -0.0008 -0.0007 3.4560 6.3052 18.2155 59.6334
frequency: -5.4175 14.7711 59.6257 70.5450 136.7860 156.6608 227.2837 294.9430 321.7321 383.1015 402.4027 451.0822 475.7168 519.6987 573.7159 604.7881 615.5079 617.6279 642.6929 700.7041 755.2290 774.2804 785.9214 847.2301 852.2825 872.2761 931.3627 940.6749 977.2973 991.1491 998.9393 1027.3164 1061.9191 1089.4025 1168.2714 1174.3612 1189.0299 1189.4267 1229.6230 1312.4711 1326.5022 1350.2805 1387.5741 1441.8833 1464.8574 1488.6370 1557.4867 1597.4164 1604.1937 1618.5273 1663.8263 3018.6502 3085.4185 3124.2420 3125.9764 3137.8279 3151.6074 3167.0611 3506.6961 3670.6720
redmass: 3.9737 5.9696 6.0752 7.4692 5.3346 6.2621 7.0664 5.0293 2.1787 4.5278 2.7829 3.4258 5.0023 5.3202 4.9741 3.8042 1.4842 5.4349 1.0911 1.7854 1.9707 11.6015 5.9549 5.2183 1.2487 5.1176 1.5749 1.6428 1.3955 5.9027 1.3426 2.1710 2.0035 1.5184 5.9253 1.0543 1.1391 1.0868 2.2656 2.8491 1.2736 1.7025 8.8315 2.2015 1.1029 2.4525 1.7210 6.1451 3.5382 6.2012 6.4651 1.0578 1.1080 1.0856 1.0886 1.0919 1.0963 1.1017 1.0455 1.1040
irintensity: 0.0033 1.9866 1.7667 9.5383 1.6372 1.1685 8.9880 22.1298 1.1706 6.7693 0.0018 1.8321 7.7116 9.7596 21.0659 2.9658 185.5712 10.4693 141.3048 50.1744 89.7010 0.6176 1.1100 43.9339 0.0012 47.1737 1.3427 1.7693 0.0157 1.0203 0.0541 3.6312 2.3735 7.2002 514.2937 0.0010 9.0993 2.0200 2.5393 13.3625 0.2114 34.2075 0.7074 9.7475 6.9553 4.2046 294.3057 0.6825 149.7982 0.9666 211.7418 14.2016 10.4607 4.5425 2.6795 13.8432 37.0710 18.5401 54.9663 62.8193
temp: 298.150 k
press: 1.00000 atm
elementType: 8 8 8 7 6 6 6 6 6 6 6 6 6 1 1 1 1 1 1 1 1 1
symmnumber: 1
zpe: 436201.4 jmol-1
zpe.correction: 0.166140 hartree
zpe.thermalcorrener: 0.177270 hartree
zpe.thermalcorrenthalpy: 0.178214 hartree
zpe.thermalcorrgfe: 0.126909 hartree
zpe.sumelectzpe: -627.846670 hartree
zpe.sumelectthermal: -627.835541 hartree
zpe.sumelectthermalent: -627.834597 hartree
zpe.sumelectthermalfe: -627.885901 hartree
dipole: 0.3101 -2.1205 0.0025
dipole: 2.1431
quadrupole: -50.7195 -86.2325 -68.3792
quadrupole: 4.5997 -0.0113 0.0052
quadrupole: 17.7243 -17.7888 0.0645 4.5997 -0.0113 0.0052
hfenergy: -628.0128105 hartree
pointgroup: C01 [X(C9H9N1O3)]
dipole: -0.1131263 0.8355269 0.0013443 debye
dipolederiv: -1.9465806 -0.0987493 -0.000088 0.1182535 -0.3906285 -0.0001137 0.0001334 -0.0000904 -0.2151376 -0.9130459 0.0004973 -0.0000226 -0.4744679 -0.8270562 -0.0002196 -0.0004491 -0.0003541 -0.3141366 -0.6288964 -0.000951 -0.0001295 -0.1765675 -0.876467 -0.0005997 -0.0003062 -0.0005038 -0.323375 -1.1803783 -0.3469046 -0.0004614 -0.0340877 -0.4196247 0.0001644 -0.0002971 0.0000838 -0.6871428 -0.019632 0.0151999 0.0000106 -0.1055528 -0.1103054 -0.0000154 -0.000044 -0.0000336 -0.017592 1.2194103 0.0307157 -0.0000572 -0.3240011 0.3311208 0.0000033 -0.000317 -0.0000344 0.3059789 -0.0501727 0.0459699 -0.097558 0.0333399 -0.1184172 -0.021751 0.0012103 -0.01171 0.0463316 -0.0501284 0.0458671 0.097634 0.0333128 -0.118465 0.0215574 -0.001134 0.0115074 0.0463096 -0.0771441 0.03612 0.1030096 0.0443944 -0.1242988 0.049919 0.1162961 0.0392145 0.0714772 -0.0772264 0.036215 -0.1029066 0.0445099 -0.1241996 -0.0501552 -0.116179 -0.0394411 0.0714644 0.0555302 0.1073787 0.0000363 0.0976398 -0.1009074 -0.000057 0.0000303 -0.0000568 -0.0354158 1.7828703 0.1360423 0.0001349 0.789243 0.8218332 0.0002511 0.0006396 0.0003844 0.2444156 1.3115026 0.3025636 0.0007839 0.1569063 0.9950025 0.000819 0.0006905 0.0008231 0.2369086 -0.0533291 -0.0169971 0.0231159 0.0868517 0.0243143 0.0408871 0.0365679 0.0978426 -0.0410128 -0.0533363 -0.0170271 -0.0231563 0.0868923 0.0244516 -0.040821 -0.0364727 -0.0977589 -0.0411046 0.0608801 -0.0511464 0.0945642 -0.0499862 0.1216811 0.0411097 0.0839941 0.0317499 -0.04241 0.0608088 -0.0510555 -0.0946579 -0.0499119 0.1217577 -0.0409089 -0.084095 -0.0315495 -0.0424221 0.0435731 -0.047114 -0.0789094 -0.0550981 0.136335 -0.0341415 -0.0944999 -0.0370634 -0.0665421 0.0436424 -0.0471862 0.0788086 -0.0551857 0.1362557 0.0343856 0.0943946 0.0373051 -0.0665333 -0.0828616 -0.1050422 -0.0000241 -0.1110818 0.1121722 0.0000352 -0.0000258 0.0000347 0.0886455 0.2141803 0.0277063 -0.0000712 -0.0257698 0.1651557 -0.0001927 -0.0001106 -0.0001776 0.3948022 0.3403337 -0.0021023 -0.0000557 -0.0296333 0.2202899 -0.0001559 -0.0000264 -0.0001719 0.386491 unknown
polarizability: 156.6229336|21.7374676|83.4988071|0.0217662|-0.002781|92.3530659 unknown
InChI: InChI=1S/C9H9NO3/c10-8(11)9(12)13-6-7-4-2-1-3-5-7/h1-5H,6,10H2
charge 0 multiplicity 1
22 atoms
O  0.957999 0.019484 -0.000476
O  2.666081 1.608325 0.000699
O  2.877984 -1.999171 -0.001791
N  4.54739 -0.351132 0.000449
C  -1.428524 0.53161 0.000098
C  -0.056734 1.149542 0.000165
C  -2.083388 0.237687 -1.222378
C  -2.082885 0.236354 1.222524
C  -3.369133 -0.346025 -1.224133
C  -3.368625 -0.347363 1.224173
C  -4.014403 -0.639019 -0.000007
C  2.268782 0.412765 -0.000193
C  3.242714 -0.794984 -0.000568
H  0.141653 1.762581 -0.896466
H  0.141911 1.761816 0.897261
H  -1.582222 0.460119 -2.172179
H  -1.581326 0.457748 2.172359
H  -3.866389 -0.571256 -2.173837
H  -3.865488 -0.573636 2.173835
H  -5.012806 -1.090464 -0.000048
H  5.306994 -1.029539 0.000283
H  4.736214 0.652859 0.001427
