program: Gaussian 09
title: 000272728
version: EM64L-G09RevD.01
frameworkgroup: C1[X(C8H14O2S)]
method: RPBEPBE
basis: SDD
operation: Freq
keyword: #p
keyword: freq=noraman
keyword: PBEPBE/SDD
title: #p freq=noraman PBEPBE/SDD
converged: YES YES NO NO
title: Mulliken charges:
elementType: S O O C C C C C C C C H H H H H H H H H H H H H H
charge: 0.175060 -0.432827 -0.436249 -0.467573 -0.504543 -0.405229 -0.414596 -0.059732 -0.080580 -0.418647 -0.375821 0.254210 0.291831 0.214669 0.240098 0.239491 0.217227 0.195423 0.228826 0.230227 0.221499 0.194521 0.226440 0.329863 0.336411
chargesum: 0.00000
title: Mulliken charges with hydrogens summed into heavy atoms:
elementType: S O O C C C C C C C C
charge: 0.175060 -0.102964 -0.099838 -0.213363 -0.212712 0.049538 0.042122 0.135692 0.148247 0.033079 0.045140
polarizability: 1.11756308e+02 2.74135892e+00 9.77760056e+01 2.46919586e+00 -1.58394390e+00 9.73581090e+01
1716.lowfreq: -21.4535 -12.8715 -0.0023 -0.0006 0.0018 10.8636 87.6386 104.9744 181.5055
frequency: 87.6247 104.9108 181.5016 207.3966 242.3295 258.7382 298.4036 310.5417 341.0081 360.2219 409.0917 447.0154 474.1855 520.3111 531.6108 571.8153 623.4654 690.5803 735.6510 773.2117 810.7770 825.4307 877.1207 886.1347 952.5922 967.4329 994.9526 1001.7055 1008.1467 1058.0980 1093.3048 1099.9093 1109.3856 1140.3305 1158.7706 1177.7305 1191.6800 1211.2933 1229.2584 1239.7868 1250.1759 1275.2458 1293.3513 1303.2056 1323.0015 1326.2219 1328.3447 1347.7993 1360.0634 1363.3612 1395.7819 1456.8073 1458.0512 1463.8784 1483.8438 2906.0889 2983.8451 2990.4914 3002.7478 3005.7089 3007.8292 3022.8583 3044.2439 3048.7573 3054.9358 3062.6225 3075.8673 3452.9839 3549.0342
redmass: 3.7559 2.5995 3.8159 6.6429 3.2414 2.8859 1.3795 2.0494 4.1955 3.3151 2.5553 2.3622 1.5713 2.6565 6.6830 4.9053 3.0247 2.5278 3.8847 2.6911 2.3466 1.8366 2.6211 2.8595 2.5694 3.7179 2.0699 2.4038 2.5137 2.3516 2.2891 2.0648 1.6167 1.1456 1.2434 1.2913 1.1043 1.3200 1.2718 1.2788 1.2640 1.4432 1.3479 1.2962 1.2961 1.4802 1.2479 1.3484 1.4014 1.2182 1.6018 1.0870 1.0808 1.0804 1.0848 1.0834 1.0647 1.0615 1.0701 1.0697 1.0695 1.0866 1.0972 1.0957 1.0916 1.0999 1.1003 1.0647 1.0661
irintensity: 0.2132 1.0217 2.9119 3.0849 1.6663 3.7349 89.2915 55.6544 7.3520 0.9179 0.8516 43.1491 72.6473 22.0488 6.1491 3.3124 5.0164 4.9354 1.9581 10.7679 12.1265 19.7328 4.4264 6.4642 23.0967 79.1772 5.9974 4.8076 34.1475 43.1666 0.3435 13.8212 22.0231 13.6418 3.1459 1.1248 12.8663 21.7517 13.1547 17.1571 7.3999 2.8253 0.5352 0.7037 3.0673 14.9859 2.9013 17.9014 2.0833 50.7819 4.7139 13.7476 6.3835 15.0929 19.4949 52.9221 12.6773 19.3818 14.3818 83.6695 18.3657 27.0258 44.2790 3.0221 18.0765 23.3223 44.7949 10.6677 4.0800
temp: 298.150 k
press: 1.00000 atm
elementType: 16 8 8 6 6 6 6 6 6 6 6 1 1 1 1 1 1 1 1 1 1 1 1 1 1
symmnumber: 1
zpe: 555310.1 jmol-1
zpe.correction: 0.211506 hartree
zpe.thermalcorrener: 0.222153 hartree
zpe.thermalcorrenthalpy: 0.223097 hartree
zpe.thermalcorrgfe: 0.176002 hartree
zpe.sumelectzpe: -860.858925 hartree
zpe.sumelectthermal: -860.848278 hartree
zpe.sumelectthermalent: -860.847334 hartree
zpe.sumelectthermalfe: -860.894429 hartree
dipole: 1.3415 3.2325 -3.1703
dipole: 4.7222
quadrupole: -73.2935 -77.8055 -74.9452
quadrupole: 0.4931 0.9885 0.5140
quadrupole: 2.0546 -2.4575 0.4029 0.4931 0.9885 0.5140
hfenergy: -861.070431 hartree
pointgroup: C01 [X(C8H14O2S1)]
dipole: -0.5836391 1.3059676 1.1855306 debye
dipolederiv: -0.2843893 0.027053 -0.0127379 0.0349827 -0.2833641 -0.051654 0.0147997 0.0205495 -0.215263 -0.7254781 -0.3162286 -0.1261523 -0.3398753 -0.3339405 0.0314606 -0.1598679 0.0182648 -0.524376 -0.3983778 0.0187355 0.2134111 0.045453 -0.6936642 -0.1145171 0.2152063 -0.0533313 -0.5647285 0.2010919 -0.0315911 -0.1786056 -0.1136185 0.0220465 0.0133522 -0.1673216 0.0085767 0.146229 0.2665801 0.0000181 0.2098783 0.0108617 0.0570572 0.0003143 0.1720723 -0.0137144 0.1098897 -0.0682569 -0.0441266 0.0477949 -0.0955546 0.0709126 -0.0536071 0.0051667 -0.0464438 0.0550382 -0.0058882 0.0460917 0.0015876 0.0859148 0.0223972 -0.0563156 -0.0144073 -0.0731615 0.0487741 0.5998088 0.1273677 0.1181117 0.2081548 0.3270451 -0.0140692 0.1716615 0.0304932 0.3368692 0.2641953 0.0195814 -0.1630435 -0.0908571 0.4148691 0.0396917 -0.1811627 0.0678041 0.3983391 -0.0176567 0.0034768 -0.0192461 0.0443785 0.0229514 -0.0096929 -0.0237577 -0.0039951 0.0391794 -0.0083816 -0.0108931 0.0736507 -0.0210377 0.0384256 0.0529835 0.0736888 0.0262541 0.0436533 -0.1345634 0.0657288 -0.0385961 0.0646041 0.0019109 0.0246287 -0.0179872 0.0246586 0.0185725 -0.0756591 -0.031623 0.0477941 -0.0241206 0.043091 0.0281538 0.04777 0.0408862 0.0003119 0.0417028 -0.0219696 0.0318272 -0.0261789 0.0618343 0.0927941 0.0793155 0.0386737 -0.1330604 0.0202746 0.0681162 0.016129 0.0684533 -0.1436007 -0.0405464 -0.0152953 0.0133741 0.0686634 0.0287294 -0.0293601 0.0113012 -0.0605853 -0.1236761 0.0379444 0.0508856 0.089757 0.0536864 -0.005055 -0.0050168 -0.0881044 0.0095464 0.0951971 0.0186082 -0.134706 -0.0195676 -0.1076684 -0.0732384 0.0111433 0.0650348 -0.0380675 -0.0334085 -0.0528714 0.0764695 -0.0688704 -0.1999005 -0.1283224 -0.0264045 -0.0872351 0.018207 0.0168191 0.0048347 -0.0795964 -0.0131333 -0.0246494 0.0805546 0.0466722 0.0125761 0.0248984 0.0755978 -0.0314007 -0.0075243 -0.086403 -0.0667724 -0.0072495 -0.0807316 0.0562513 -0.0728764 -0.0571916 0.0886809 0.0637199 0.1221533 0.0215133 0.0195751 -0.0017976 0.0492948 -0.0206992 0.000933 -0.1587494 0.0165195 -0.1320894 -0.0777724 -0.0019824 0.0562712 -0.0438709 0.0631739 -0.1002398 0.1104888 -0.0405913 0.0716124 0.0462844 0.2299808 0.1555893 -0.0371303 0.2467989 0.1072351 -0.0132096 -0.0360257 -0.0405145 0.2949949 0.1820055 -0.0461024 -0.1599209 -0.0219566 0.3907623 0.0526975 -0.1090318 -0.0218335 0.2321923 unknown
polarizability: 112.0967999|-1.7510652|97.6948681|2.2562871|1.7321468|97.0987541 unknown
InChI: InChI=1S/C8H14O2S/c9-5-1-2-6(10)8-4-3-7(5)11-8/h5-10H,1-4H2
charge 0 multiplicity 1
25 atoms
S  0.027661 0.71556 -1.661093
O  -2.792604 -0.931174 -0.535217
O  2.033574 -1.602869 -0.845096
C  -1.197706 0.968777 -0.225604
C  1.468633 0.75961 -0.410951
C  -0.462647 1.846565 0.836176
C  1.078721 1.868949 0.585391
C  -1.751156 -0.364603 0.344586
C  1.718018 -0.633441 0.214484
C  -0.744129 -1.517173 0.512117
C  0.620645 -1.187239 1.164788
H  -2.040215 1.532391 -0.667436
H  2.359933 1.029325 -1.004012
H  -0.691389 1.461676 1.847747
H  -0.851358 2.879221 0.796543
H  1.367181 2.843177 0.154188
H  1.641396 1.748528 1.53191
H  -2.202427 -0.114871 1.334497
H  2.660014 -0.564774 0.793798
H  -0.584136 -1.957208 -0.489402
H  -1.25261 -2.298973 1.105901
H  0.498849 -0.50589 2.030463
H  1.033209 -2.129624 1.571395
H  -3.53693 -0.282182 -0.622706
H  1.320076 -1.518053 -1.537169
