program: Gaussian 09
title: 000272716
version: EM64L-G09RevD.01
frameworkgroup: C1[X(C5H5N3O2S)]
method: RPBEPBE
basis: SDD
operation: Freq
keyword: #p
keyword: freq=noraman
keyword: PBEPBE/SDD
title: #p freq=noraman PBEPBE/SDD
converged: YES YES NO NO
title: Mulliken charges:
elementType: S O O N N N C C C C C H H H H H
charge: 0.169897 -0.413178 -0.189393 -0.046658 -0.350791 -0.006161 -0.422063 0.200742 -0.329252 -0.401643 0.220971 0.264748 0.268869 0.282128 0.361493 0.390291
chargesum: 0.00000
title: Mulliken charges with hydrogens summed into heavy atoms:
elementType: S O O N N N C C C C C
charge: 0.169897 -0.022887 -0.189393 -0.046658 0.010703 -0.006161 0.111553 0.200742 -0.329252 -0.119515 0.220971
polarizability: 1.13773038e+02 -2.29421914e+01 8.57523293e+01 4.41094420e+00 -7.02617333e+00 7.58016818e+01
1716.lowfreq: -9.1370 -5.7724 -2.5742 0.0001 0.0007 0.0009 20.6837 31.5706 45.5347
frequency: 20.4597 31.5554 45.5178 79.1802 206.2304 251.9743 264.6456 343.1761 365.3366 470.5675 530.6916 596.2837 601.9159 647.1679 684.9013 693.5410 709.3258 776.9652 853.0800 885.5402 930.3202 976.1971 993.2560 1070.0264 1082.6515 1117.7874 1166.6799 1178.9428 1213.9231 1270.6011 1289.2454 1316.6125 1344.0496 1420.1689 1432.1039 1487.4351 1637.6929 3005.0806 3073.9814 3250.3996 3517.3435 3626.5166
redmass: 7.1092 10.1274 6.3702 7.9131 8.1076 8.9155 7.5170 2.2433 8.4198 3.8119 6.1301 1.4795 2.8611 3.6683 3.6806 1.6431 4.4357 5.8814 1.3678 2.3101 6.6169 4.1980 4.2008 2.0798 3.4578 6.0902 2.7317 2.2850 1.7276 2.4175 3.0783 1.8136 2.6497 1.6100 1.1988 4.2118 10.0535 1.0588 1.1010 1.0995 1.0644 1.0837
irintensity: 0.0751 0.2566 1.1802 0.0920 0.3707 0.5818 3.5314 5.1565 3.9924 11.0485 13.4481 125.3294 34.1842 32.7445 49.0122 74.1249 7.6291 21.4663 31.0382 3.8728 16.0479 32.9417 225.8239 35.5012 33.1050 2.4141 45.1388 15.8879 2.5884 12.7510 12.4657 10.9839 5.6986 6.1004 27.6222 18.2970 151.3700 6.1341 6.1282 0.5414 38.3535 123.1879
temp: 298.150 k
press: 1.00000 atm
elementType: 16 8 8 7 7 7 6 6 6 6 6 1 1 1 1 1
symmnumber: 1
zpe: 277887.0 jmol-1
zpe.correction: 0.105842 hartree
zpe.thermalcorrener: 0.116059 hartree
zpe.thermalcorrenthalpy: 0.117004 hartree
zpe.thermalcorrgfe: 0.066662 hartree
zpe.sumelectzpe: -905.435639 hartree
zpe.sumelectthermal: -905.425421 hartree
zpe.sumelectthermalent: -905.424477 hartree
zpe.sumelectthermalfe: -905.474818 hartree
dipole: -2.0371 1.2021 -1.9295
dipole: 3.0525
quadrupole: -69.5834 -63.2067 -76.5971
quadrupole: -2.3436 -2.5339 -0.8182
quadrupole: 0.2124 6.5890 -6.8014 -2.3436 -2.5339 -0.8182
hfenergy: -905.5414801 hartree
pointgroup: C01 [X(C5H5N3O2S1)]
dipole: 0.4576043 -0.8060018 -0.7636919 debye
dipolederiv: -0.2087702 0.0450321 0.0665685 0.2048638 -0.367554 -0.0208263 0.1003472 -0.020628 -0.0771686 -0.439684 -0.0895525 -0.0909457 -0.0048049 -0.9619452 -0.4416183 -0.0699379 -0.3483161 -0.51252 -0.4029804 -0.0798641 0.2099692 -0.1567997 -0.5412245 0.1056406 0.169091 -0.0848746 -0.7711796 -0.01928 -0.1891327 -0.0888925 -0.1493624 -0.0698046 -0.0537042 0.0297031 -0.1831522 -0.2989125 -0.3733423 0.2024505 0.149517 0.226717 -0.3114525 0.0787852 0.0810823 0.1176098 0.0203488 -0.2470787 -0.0183172 -0.0885843 -0.1220725 0.0008812 0.0141301 -0.2366479 0.1417177 -0.2154482 -0.0490496 0.0727654 0.1241858 0.3197454 -0.1689093 -0.0888394 0.1259306 -0.0746853 -0.0177003 0.2074125 -0.079218 0.1136678 -0.1096442 0.0447949 -0.0109728 0.3252159 -0.1744374 0.0391096 0.4030787 -0.2615213 -0.2852686 -0.3820341 0.3955618 0.0452473 -0.4299044 0.2613472 0.0351938 -0.1470921 0.082708 0.0484782 0.0431668 -0.0557808 0.0774034 0.0298305 0.1285236 0.0274374 0.4185262 0.2635079 -0.1842579 0.2048361 1.2709548 0.2877149 -0.1138546 0.2278726 1.0472862 0.0008003 0.0163094 0.0047456 -0.0113175 -0.0155898 0.1036559 -0.0128777 0.0551478 0.0685231 0.0486508 0.0387542 -0.0046903 -0.074203 0.1022846 -0.0628474 -0.0328959 -0.0570053 0.0880833 0.1454809 0.0369247 -0.0061084 0.0537795 0.0786465 -0.0552354 -0.0007962 -0.062666 0.1053987 0.3176557 -0.005749 -0.0607672 -0.0097311 0.3174739 -0.0452862 -0.0809473 -0.0328627 0.2550221 0.3456723 -0.0350975 0.092383 -0.0331391 0.2816629 0.0667526 0.1166613 0.106409 0.2065263 unknown
polarizability: 92.7610174|-25.0646394|107.7248007|-1.6097579|8.9970175|74.8412308 unknown
InChI: InChI=1S/C5H5N3O2S/c9-5(10)4(11)1-3-2-6-8-7-3/h2,8-9H,1H2
charge 0 multiplicity 1
16 atoms
S  -1.993006 2.588601 0.003269
O  -1.983772 -1.274741 -0.355592
O  -2.406389 -0.134923 1.631477
N  1.554303 -0.966666 -1.144027
N  2.599828 -1.160746 -0.277345
N  2.703144 -0.276555 0.767807
C  -0.282936 0.749574 -1.282854
C  0.929526 0.139923 -0.618478
C  -1.39379 1.047779 -0.29103
C  1.636096 0.55674 0.551811
C  -1.975726 -0.135365 0.460871
H  -0.016857 1.685611 -1.802736
H  -0.655487 0.025152 -2.032381
H  1.439001 1.38403 1.228091
H  3.266015 -1.920037 -0.403912
H  -2.371752 -2.042479 0.145828
