program: Gaussian 09
title: 000272691
version: EM64L-G09RevD.01
frameworkgroup: C1[X(C6H10F2)]
method: RPBEPBE
basis: SDD
operation: Freq
keyword: #pfreq=noraman
keyword: PBEPBE/SDD
title: #p freq=noraman PBEPBE/SDD
converged: YES YES NO NO
title: Mulliken charges:
elementType: F F C C C C C C H H H H H H H H H H
charge: -0.192170 -0.192736 -0.349300 -0.339960 -0.501672 -0.688661 0.323443 -0.192959 0.206431 0.221975 0.196823 0.194579 0.227623 0.215552 0.218724 0.211703 0.214330 0.226274
chargesum: 0.00000
title: Mulliken charges with hydrogens summed into heavy atoms:
elementType: F F C C C C C C
charge: -0.192170 -0.192736 0.079106 0.051442 -0.058497 -0.043904 0.323443 0.033315
polarizability: 8.78360306e+01 -5.83305251e+00 6.01413266e+01 -4.41066921e+00 7.58374735e-01 5.23020712e+01
1716.lowfreq: -6.4174 -0.0008 -0.0005 0.0012 9.6475 13.6371 52.4146 70.5995 95.5882
frequency: 52.3306 70.4700 95.5726 126.2277 216.2653 227.4164 232.7016 303.1883 337.9135 408.0952 542.3502 651.0917 733.7173 758.7768 787.6835 828.3411 897.6320 917.2326 1006.3240 1036.4003 1070.1268 1106.8004 1115.8942 1181.3270 1208.2961 1259.6830 1270.5333 1288.9853 1308.7398 1330.7916 1353.0776 1391.8488 1447.0088 1469.7604 1477.0781 1477.6021 1488.3171 1715.0348 2965.3100 2974.8989 2976.3550 2988.7508 3009.2719 3032.2668 3058.6966 3074.1974 3075.8259 3196.3477
redmass: 4.1207 1.9108 3.8734 2.4924 2.8778 1.4838 3.4703 4.5485 3.3305 3.0798 4.6479 6.1367 1.0808 1.2818 1.2461 5.7415 1.7659 1.2931 4.6264 2.8336 2.5583 2.2711 1.7362 2.5071 1.4500 1.3875 1.2379 1.0862 1.2800 1.4453 1.5561 1.2124 1.0989 1.0641 1.0677 1.0423 1.0836 8.1674 1.0591 1.0583 1.0393 1.0603 1.0991 1.0995 1.1032 1.1011 1.0994 1.0959
irintensity: 0.3961 0.6372 2.1846 0.3811 1.6357 0.7352 0.3763 0.7430 0.4072 0.3079 7.5800 13.2609 8.0622 39.5219 2.9722 39.7142 5.5968 2.4752 10.3103 59.6192 0.7217 30.6448 47.0422 34.2924 3.6805 12.0211 2.5810 1.9610 11.2579 5.8074 0.1354 12.1717 8.8057 1.0355 3.2785 13.0427 20.9540 15.0636 28.0585 9.8341 24.2139 56.2577 9.6653 0.8452 20.9389 96.2871 48.4750 10.3467
temp: 298.150 k
press: 1.00000 atm
elementType: 9 9 6 6 6 6 6 6 1 1 1 1 1 1 1 1 1 1
symmnumber: 1
zpe: 386050.2 jmol-1
zpe.correction: 0.147039 hartree
zpe.thermalcorrener: 0.156641 hartree
zpe.thermalcorrenthalpy: 0.157585 hartree
zpe.thermalcorrgfe: 0.111488 hartree
zpe.sumelectzpe: -433.641890 hartree
zpe.sumelectthermal: -433.632287 hartree
zpe.sumelectthermalent: -433.631343 hartree
zpe.sumelectthermalfe: -433.677440 hartree
dipole: -2.8263 -2.3769 0.6384
dipole: 3.7477
quadrupole: -55.9738 -47.0307 -48.0598
quadrupole: -3.9976 0.8537 -0.0229
quadrupole: -5.6190 3.3241 2.2950 -3.9976 0.8537 -0.0229
hfenergy: -433.7889285 hartree
pointgroup: C01 [X(C6H10F2)]
dipole: -1.1153391 0.9240612 -0.2759495 debye
dipolederiv: -0.31255 0.0996917 -0.0472815 -0.0377705 -0.839298 -0.0308251 -0.0567891 0.0236622 -0.1310384 -1.0037634 -0.0202492 -0.2523788 0.3135597 -0.2254559 0.0906434 -0.3297654 -0.0117903 -0.1777082 -0.001369 0.0104174 -0.0157418 0.0856137 0.1270352 0.0574069 -0.1048122 0.0473255 0.0842971 0.0487184 -0.0075724 0.0254436 -0.0536535 0.1584051 0.0347424 0.0886128 0.0450045 0.1149045 -0.1524341 0.0677047 0.0052474 -0.0282196 0.0430409 0.0111616 0.0070276 0.0581648 0.1176473 -0.0708757 -0.0244542 0.0480808 0.0049708 0.0806045 0.0227364 0.0081815 0.0198512 0.0510539 0.4339617 -0.0533441 0.1170561 -0.026958 0.8968298 0.0394877 0.1924089 -0.0025336 0.0369298 0.7985029 -0.0793151 0.3250165 -0.3168649 0.1502706 -0.0977838 0.3425759 -0.0135079 -0.072608 0.0355373 -0.0125998 -0.0224992 -0.0177769 0.0441235 -0.0863335 -0.0163939 -0.0607414 -0.1452277 0.0612156 0.0040373 0.00499 0.0029701 -0.1361 0.0383933 0.0034786 0.0162603 0.0687271 0.0289912 0.0006422 0.0063903 -0.0076678 0.0450446 -0.0954178 -0.0256593 -0.0680655 -0.1799116 0.0252179 -0.0271983 0.0106754 0.0128294 -0.2012558 0.0603889 0.0008859 0.0330076 0.06273 0.0130467 -0.0199048 -0.0705263 -0.0013587 0.0728541 -0.0759573 -0.039759 -0.057947 -0.1037389 0.0589548 -0.0138378 0.0028831 -0.0138656 -0.1340221 0.0399139 0.0086701 -0.0049266 0.0965453 -0.1976894 0.0468865 -0.054055 0.0661792 0.078952 0.0320584 -0.0763922 0.0337594 0.0554613 0.0830575 -0.0308506 -0.0413582 -0.0186168 0.0465932 -0.0995365 0.0215529 -0.0781991 -0.1478288 0.0882676 0.0284029 0.012772 -0.0318741 -0.1775986 0.0405687 0.0267877 0.0161821 0.0764022 0.0632102 0.0315437 -0.0547143 0.0685035 -0.0300231 0.0183524 -0.0506109 0.0044938 0.1933631 unknown
polarizability: 87.8400008|6.0382958|60.210547|4.0813072|0.4967443|52.2288805 unknown
InChI: InChI=1S/C6H10F2/c1-2-3-4-6(8)5-7/h5H,2-4H2,1H3
charge 0 multiplicity 1
18 atoms
F  1.345043 -1.450764 -0.205079
F  3.454966 0.217631 0.528774
C  -1.321646 -0.085215 0.215472
C  -2.709356 0.333775 -0.318936
C  -0.170454 0.3998 -0.70781
C  -3.862434 -0.138193 0.592392
C  1.188193 -0.046274 -0.252959
C  2.225095 0.742296 0.106309
H  -1.172892 0.324072 1.234387
H  -1.274528 -1.18737 0.305033
H  -2.848839 -0.081727 -1.337919
H  -2.746711 1.437509 -0.4240
H  -0.348993 0.017536 -1.733589
H  -0.179101 1.504839 -0.77189
H  -4.84516 0.167617 0.189555
H  -3.766232 0.287783 1.608657
H  -3.864852 -1.239951 0.689591
H  2.193202 1.833938 0.104112
