program: Gaussian 09
title: 000272634
version: EM64L-G09RevD.01
frameworkgroup: C1[X(C12H14N2O2)]
method: RPBEPBE
basis: SDD
operation: Freq
keyword: #p
keyword: freq=noraman
keyword: PBEPBE/SDD
title: #p freq=noraman PBEPBE/SDD
converged: YES YES NO NO
title: Mulliken charges:
elementType: O O N N C C C C C C C C C C C C H H H H H H H H H H H H H H
charge: -0.289242 -0.240539 -0.371208 0.040530 -0.283253 -0.535724 0.519291 0.022975 -0.445572 -0.383923 0.436871 -0.413226 -0.352764 0.167479 -0.803997 -0.497666 0.246609 0.256622 0.265297 0.318709 0.230157 0.251225 0.232161 0.232327 0.224676 0.233525 0.232129 0.239246 0.240342 0.226945
chargesum: 0.00000
title: Mulliken charges with hydrogens summed into heavy atoms:
elementType: O O N N C C C C C C C C C C C C
charge: -0.289242 -0.240539 -0.052499 0.040530 -0.036645 -0.013805 0.519291 0.022975 -0.215416 -0.132698 0.436871 -0.181065 -0.120437 0.167479 -0.113667 0.208867
polarizability: 2.20792410e+02 9.81573416e+00 1.26890284e+02 -5.36516488e+00 -7.48595096e+00 1.20731703e+02
1716.lowfreq: -9.9370 -0.0012 -0.0006 -0.0005 2.9732 10.0378 20.3403 29.7562 42.7553
frequency: 20.2455 29.6685 42.5365 48.4087 78.9127 95.9807 123.3387 129.0478 175.9769 202.7606 241.1871 273.0602 292.8558 345.8712 367.6767 385.4171 407.6530 411.7966 467.1902 503.4546 542.1619 565.7628 634.0936 689.4158 716.5921 726.0598 733.9620 791.7969 807.3873 824.8981 851.3187 853.4812 931.0129 947.2155 952.7942 953.7277 976.6254 989.3111 1010.7969 1015.5389 1048.8451 1058.9872 1112.6505 1119.6469 1123.1293 1135.0980 1146.2412 1193.4356 1214.8291 1219.8857 1223.4566 1275.5648 1289.7498 1326.9810 1330.1701 1385.0867 1397.0212 1399.0112 1412.0409 1424.3093 1449.2984 1459.2779 1465.1900 1470.5260 1475.7340 1507.7830 1517.2920 1585.9380 1624.1271 1639.0407 2977.8707 2998.8219 3010.8040 3026.6673 3056.3499 3080.6619 3085.7823 3097.3263 3111.9209 3115.9405 3135.5163 3141.2902 3141.5670 3599.6305
redmass: 4.7717 3.8431 3.4689 1.1009 1.1332 3.4890 4.3552 3.9652 3.8504 3.3227 5.7620 4.8673 4.6777 2.8685 2.6743 2.1053 2.9675 4.8149 5.3515 2.2689 2.7063 3.9111 6.9086 7.2158 5.4735 3.4098 3.1725 5.3206 4.7978 1.5785 1.2562 6.2935 6.4642 3.3973 1.9451 1.5376 1.3808 1.4499 3.3018 2.9005 1.5591 6.8257 1.2660 1.9798 1.7046 1.2391 1.5435 1.1195 1.6704 1.7713 2.9655 1.4875 1.5124 5.1170 1.5021 3.4930 1.4372 1.2886 2.3799 1.2099 1.0503 1.1189 1.0539 1.0455 1.1054 2.6709 5.0551 5.9113 6.3290 10.7735 1.0373 1.0297 1.0812 1.0675 1.0976 1.1027 1.0988 1.1041 1.0875 1.0872 1.0959 1.1043 1.0973 1.0807
irintensity: 0.7681 0.2320 1.7279 0.5616 0.7007 0.2702 2.9560 1.7625 0.7602 9.4863 4.5525 2.2766 9.5706 1.2743 26.2580 102.7123 8.5757 8.3012 5.7062 52.5272 14.9021 5.7913 0.2100 14.0983 10.8668 2.0017 3.7594 30.8428 2.5519 39.4639 0.1696 12.4338 5.0532 0.9257 4.3354 1.8304 1.1226 3.1915 4.4830 27.7787 10.9156 423.5398 0.3173 71.4351 48.8155 4.8591 13.5765 3.9044 41.5680 34.7976 3.2653 50.6224 6.3041 70.5168 0.4588 4.3302 55.0392 18.8478 6.1745 25.6124 12.3261 6.5131 14.0813 13.3708 16.4901 41.4389 221.0331 0.2588 3.5341 314.4462 35.0246 49.6049 18.1910 19.6661 19.6574 10.0449 19.5567 29.6791 10.5416 13.9590 38.6423 18.4821 1.9631 79.7586
temp: 298.150 k
press: 1.00000 atm
elementType: 8 8 7 7 6 6 6 6 6 6 6 6 6 6 6 6 1 1 1 1 1 1 1 1 1 1 1 1 1 1
symmnumber: 1
zpe: 626648.7 jmol-1
zpe.correction: 0.238678 hartree
zpe.thermalcorrener: 0.254501 hartree
zpe.thermalcorrenthalpy: 0.255445 hartree
zpe.thermalcorrgfe: 0.192671 hartree
zpe.sumelectzpe: -724.424310 hartree
zpe.sumelectthermal: -724.408487 hartree
zpe.sumelectthermalent: -724.407543 hartree
zpe.sumelectthermalfe: -724.470317 hartree
dipole: -4.4666 0.7879 2.7536
dipole: 5.3060
quadrupole: -91.8081 -87.0288 -95.1645
quadrupole: 6.9623 12.4367 -4.2225
quadrupole: -0.4743 4.3050 -3.8307 6.9623 12.4367 -4.2225
hfenergy: -724.662988 hartree
pointgroup: C01 [X(C12H14N2O2)]
dipole: -1.7576468 -0.4288517 -1.0414401 debye
polarizability: 219.4408066|-12.9315923|124.8679128|8.7942146|-8.698038|124.1056773 unknown
InChI: InChI=1S/C12H14N2O2/c1-8-3-5-9(6-4-8)10-7-11(14-13-10)12(15)16-2/h3-6,10,13H,7H2,1-2H3
charge 0 multiplicity 1
30 atoms
O  3.442656 -1.390597 -0.474633
O  4.116207 -0.100877 1.365541
N  0.549169 1.986542 0.260697
N  1.693004 1.486498 0.817023
C  -0.035573 1.147804 -0.842559
C  1.122421 0.101486 -1.046902
C  -1.389271 0.555391 -0.462446
C  2.073919 0.420415 0.10742
C  -2.509212 0.711688 -1.311791
C  -1.55136 -0.17153 0.746867
C  -3.927976 -0.580925 0.233162
C  -3.760227 0.148383 -0.969705
C  -2.800058 -0.728386 1.086039
C  3.293632 -0.317118 0.44233
C  -5.268129 -1.189662 0.607819
C  4.638824 -2.230646 -0.253205
H  -0.160081 1.773354 -1.745384
H  1.624445 0.23328 -2.021003
H  0.758206 -0.938092 -1.006915
H  0.024485 2.677242 0.794743
H  -2.405207 1.275713 -2.247673
H  -0.697462 -0.297017 1.424183
H  -4.616117 0.279388 -1.642606
H  -2.907385 -1.285996 2.024772
H  -6.041514 -0.961249 -0.145282
H  -5.197985 -2.290332 0.695255
H  -5.624045 -0.809666 1.583782
H  4.606854 -2.691756 0.748909
H  5.557171 -1.62443 -0.336179
H  4.596711 -2.995405 -1.042059
