program: Gaussian 09
title: 000272624
version: EM64L-G09RevD.01
frameworkgroup: C1[X(C16H15NO)]
method: RPBEPBE
basis: SDD
operation: Freq
keyword: #p
keyword: freq=noraman
keyword: PBEPBE/SDD
title: #p freq=noraman PBEPBE/SDD
converged: YES YES NO NO
title: Mulliken charges:
elementType: O N C C C C C C C C C C C C C C C C H H H H H H H H H H H H H H H
charge: -0.273708 -0.618783 0.041241 -0.349338 -0.582091 0.437216 0.410929 0.240775 -0.392000 -0.407487 -0.397694 -0.421037 -0.247453 -0.229629 -0.260063 -0.238289 -0.248707 -0.240255 0.264226 0.271585 0.248155 0.248267 0.248096 0.257627 0.234215 0.333042 0.313034 0.221737 0.227523 0.226455 0.226505 0.226408 0.229496
chargesum: 0.00000
title: Mulliken charges with hydrogens summed into heavy atoms:
elementType: O N C C C C C C C C C C C C C C C C
charge: -0.273708 0.027292 0.041241 -0.085112 -0.062351 0.437216 0.410929 0.240775 -0.143732 -0.159391 -0.140067 -0.186822 -0.025716 -0.002106 -0.033608 -0.011784 -0.022299 -0.010759
polarizability: 2.12182938e+02 3.45055140e+00 1.59679027e+02 -1.30532093e+01 -1.24794582e+00 1.46465419e+02
1716.lowfreq: -0.0002 0.0006 0.0007 2.2701 4.6294 6.7448 27.9386 36.4120 50.1243
frequency: 27.9033 36.0000 50.0100 71.8418 80.9008 102.3582 163.6807 195.4804 236.9852 254.3312 289.9479 337.2256 377.4014 403.0619 406.3152 417.7441 451.2300 480.4046 523.8626 547.0593 576.2458 587.6645 606.3750 616.1639 617.3656 676.0345 701.1494 707.0351 711.7008 766.1784 774.2758 791.6767 829.3673 840.5411 847.1379 857.4582 921.2662 923.5192 950.9107 971.8720 978.4342 980.9996 990.4814 991.7855 993.7854 996.9907 1020.1931 1029.8008 1049.8988 1064.1809 1079.3153 1083.7830 1095.7416 1104.2322 1137.6697 1172.0015 1173.6499 1185.3741 1206.7156 1249.4723 1289.5573 1295.7748 1312.3039 1334.4956 1372.5184 1376.2379 1403.7730 1433.1307 1436.0748 1461.8542 1483.7332 1490.5271 1584.2962 1586.7506 1588.8835 1610.9078 1612.7357 1631.0270 3104.0489 3111.7518 3116.8901 3122.0227 3124.1565 3133.2678 3135.9714 3146.0508 3149.0794 3159.9464 3163.4302 3172.1249 3207.7794 3520.7156 3676.9958
redmass: 3.9536 4.4776 3.9368 4.9291 4.8163 5.4800 4.4244 5.7088 4.1664 4.9792 4.9444 2.8789 4.4658 2.8129 2.8276 2.9634 3.6907 1.1889 2.5198 3.2299 2.1573 3.7189 2.1798 5.6894 6.3348 5.3639 1.7457 1.7142 3.2061 2.1012 2.0603 2.8651 2.4100 4.2861 1.2669 1.2733 1.5173 1.4548 1.3915 1.5813 1.7594 2.3445 3.5117 4.4807 1.5163 1.4211 2.4457 2.2487 1.6239 1.8396 1.5568 1.4178 1.5456 1.4382 2.5844 1.0526 1.0537 1.1121 1.1293 1.7168 3.6202 3.2852 1.3606 1.4315 6.3246 6.8091 2.8730 2.2202 2.1151 1.3190 2.3838 2.0898 2.6325 4.2359 3.1865 6.0419 5.8881 2.6488 1.0590 1.0866 1.0863 1.0846 1.0863 1.0890 1.0916 1.0962 1.0933 1.0970 1.1015 1.0974 1.1146 1.0446 1.1044
irintensity: 0.3126 9.9970 0.0178 0.9233 2.2835 7.7643 2.4849 2.6514 0.7553 1.8009 0.9410 3.1318 0.2580 0.4955 0.0661 2.5820 3.7266 165.2247 12.4064 24.9084 88.8307 8.4389 28.8927 1.3759 0.2358 5.1200 52.0991 50.0570 25.0945 34.5995 37.3079 13.2475 0.4223 14.2532 0.6974 0.4007 2.2826 2.0898 8.1312 0.4683 3.6764 6.1360 0.1991 0.3373 0.1069 0.5820 21.0929 10.8363 1.4283 3.5138 9.7935 5.8276 9.0676 4.0517 7.8089 0.0105 0.1810 0.4338 1.8315 40.5427 57.3943 7.0074 5.2108 6.5959 8.9114 1.7869 149.1637 2.7324 11.6591 38.6315 5.8542 34.3508 41.7097 13.1650 34.1114 12.1930 5.4941 221.6438 7.9071 12.9096 7.6262 0.4761 0.7102 11.8929 16.0710 35.3271 31.8189 24.3438 24.8888 7.3009 4.8795 33.5044 23.8420
temp: 298.150 k
press: 1.00000 atm
elementType: 8 7 6 6 6 6 6 6 6 6 6 6 6 6 6 6 6 6 1 1 1 1 1 1 1 1 1 1 1 1 1 1 1
symmnumber: 1
zpe: 697787.7 jmol-1
zpe.correction: 0.265773 hartree
zpe.thermalcorrener: 0.281237 hartree
zpe.thermalcorrenthalpy: 0.282181 hartree
zpe.thermalcorrgfe: 0.221591 hartree
zpe.sumelectzpe: -747.402291 hartree
zpe.sumelectthermal: -747.386827 hartree
zpe.sumelectthermalent: -747.385883 hartree
zpe.sumelectthermalfe: -747.446473 hartree
dipole: -2.8394 -0.6056 2.5187
dipole: 3.8435
quadrupole: -104.4054 -101.9333 -95.7360
quadrupole: 3.7249 3.8807 -8.2509
quadrupole: -3.7138 -1.2417 4.9556 3.7249 3.8807 -8.2509
hfenergy: -747.6680643 hartree
pointgroup: C01 [X(C16H15N1O1)]
dipole: -0.9927213 -0.3798082 1.0755823 debye
polarizability: 207.8763967|3.7324236|159.1760487|-20.8869599|1.5329295|151.274939 unknown
InChI: InChI=1S/C16H15NO/c17-15(18)14-11-16(14,12-7-3-1-4-8-12)13-9-5-2-6-10-13/h1-10,14H,11,17H2
charge 0 multiplicity 1
33 atoms
O  2.629124 -2.141353 -1.2951
N  1.886605 -3.105161 0.677233
C  -0.147569 -0.379811 -0.587339
C  0.263934 -1.906971 -0.694019
C  -0.060989 -1.094927 -1.942064
C  0.872589 0.672571 -0.184504
C  -1.555165 -0.149321 -0.063518
C  1.681354 -2.37416 -0.483669
C  0.613936 1.505432 0.939665
C  -2.425803 0.721449 -0.767555
C  2.091949 0.866276 -0.89109
C  -2.016563 -0.745371 1.136214
C  1.534589 2.49703 1.342012
C  -3.728194 0.982768 -0.288882
C  3.011858 1.857617 -0.486618
C  -3.320098 -0.488413 1.619495
C  2.740907 2.680638 0.630022
C  -4.18113 0.377762 0.907487
H  -0.506199 -2.600507 -0.336153
H  0.789466 -0.878829 -2.594311
H  -0.999223 -1.311301 -2.460922
H  -0.320429 1.387581 1.497426
H  -2.073949 1.193973 -1.692177
H  2.342847 0.228558 -1.742875
H  -1.348482 -1.409742 1.698047
H  2.825886 -3.449045 0.87438
H  1.146076 -3.257676 1.35896
H  1.30604 3.128116 2.208636
H  -4.389264 1.656275 -0.845958
H  3.944919 1.98331 -1.047393
H  -3.661007 -0.958923 2.548758
H  3.45609 3.451802 0.937731
H  -5.192307 0.578554 1.27878
