program: Gaussian 09
title: 000272620
version: EM64L-G09RevD.01
frameworkgroup: C1[X(C15H19BrO)]
method: RPBEPBE
basis: SDD
operation: Freq
keyword: #p
keyword: freq=noraman
keyword: PBEPBE/SDD
title: #p freq=noraman PBEPBE/SDD
converged: YES YES NO NO
title: Mulliken charges:
elementType: Br O C C C C C C C C C C C C C C C H H H H H H H H H H H H H H H H H H H
charge: 0.003375 -0.278863 -0.148032 -0.513680 0.004047 -0.442131 -0.432655 -0.409324 0.503805 0.287118 -0.752410 -0.514577 -0.384542 -0.402436 -0.222788 -0.235101 -0.239882 0.206976 0.208914 0.231482 0.173788 0.209408 0.230297 0.203107 0.209941 0.196091 0.208534 0.290300 0.205548 0.195500 0.234678 0.258897 0.230391 0.228079 0.226422 0.229723
chargesum: 0.00000
title: Mulliken charges with hydrogens summed into heavy atoms:
elementType: Br O C C C C C C C C C C C C C C C
charge: 0.003375 -0.278863 0.058943 -0.073283 0.177835 -0.002426 -0.019607 -0.004699 0.503805 0.287118 -0.462111 0.121150 -0.125645 -0.172044 0.005291 -0.008679 -0.010160
polarizability: 2.17259149e+02 1.10415745e+01 1.84779249e+02 9.75131995e+00 -9.10307517e+00 1.31505618e+02
1716.lowfreq: -7.4366 -0.0005 -0.0004 0.0002 2.0385 8.9169 28.3790 40.7751 56.5563
frequency: 27.9663 40.7674 56.5460 59.0022 79.4780 91.1954 126.9409 169.8793 175.0464 192.5168 202.1712 221.5608 241.1938 271.4416 284.5248 354.5060 403.0377 419.4035 432.3949 444.0997 483.0620 488.3628 555.7513 571.9409 613.2557 633.9992 687.5186 704.0187 768.0455 777.7732 792.5369 802.4037 845.1599 851.9190 876.7289 879.1006 912.0377 921.1465 937.6830 963.7480 975.8215 988.9259 995.8719 1020.3922 1037.0851 1049.1825 1059.4628 1073.5907 1085.8450 1103.8448 1114.5819 1132.7370 1139.2327 1162.3546 1173.1371 1190.0336 1193.2593 1201.5964 1241.9761 1264.8377 1265.9631 1283.0749 1298.7010 1303.8091 1315.8042 1322.9989 1335.1770 1342.3885 1350.4498 1362.9442 1372.4519 1430.4048 1432.9329 1456.5816 1461.2235 1462.8836 1467.0147 1476.3376 1479.2882 1479.7970 1581.9127 1607.6783 1622.9710 2891.9745 2927.8623 2933.3251 2968.5553 2977.8820 2982.1265 2987.2246 3006.0935 3035.4963 3044.7961 3050.1993 3056.5675 3097.1727 3122.2598 3129.6147 3142.3032 3153.4633 3166.5053 3206.5098
redmass: 4.0102 3.9713 5.2293 3.2487 4.6469 3.5847 2.0849 4.0556 2.2060 2.4005 4.3256 2.8600 4.0613 2.4826 2.6405 3.6492 2.8324 3.3920 3.9409 2.3821 2.9365 2.8403 3.5047 3.3518 5.8810 4.2908 5.9152 1.6580 2.0585 1.9161 1.4307 3.1140 2.1229 1.2528 2.0252 1.8371 2.3051 1.4639 2.0319 2.8730 1.3887 5.9132 1.3258 3.0859 2.3113 2.8046 1.5689 1.3502 1.6645 2.2862 1.3594 2.2482 2.5491 1.6435 1.0530 1.1555 1.5021 1.4951 1.3481 1.2310 1.3829 1.2335 1.4642 1.2541 1.3699 1.4440 1.4069 1.5008 1.4996 1.5591 6.2344 2.2408 1.1325 1.0724 1.0765 1.0893 1.0854 1.0624 2.0398 1.1413 5.8982 6.2441 8.2670 1.0826 1.0353 1.0804 1.0646 1.0619 1.0605 1.0608 1.1006 1.0960 1.1016 1.1019 1.1023 1.0974 1.0851 1.0874 1.0926 1.0960 1.1014 1.0934
irintensity: 0.1280 0.0649 0.3625 2.1436 0.7580 1.5328 0.9040 0.6265 0.0708 1.9475 1.7508 4.1629 0.5241 0.6282 2.4258 0.5538 0.0951 7.2742 0.5453 0.7188 2.0136 6.4211 3.1155 16.1548 5.9263 18.5017 15.6362 53.5720 1.3924 39.7380 31.9300 27.5660 14.6820 0.1782 15.0097 6.7072 4.2071 4.6261 0.4126 9.2713 0.2407 0.5727 0.0323 1.4538 13.0363 112.4115 20.4695 1.9003 6.6948 0.7279 0.2399 12.7672 2.2709 4.0824 0.0309 3.8921 6.7290 0.3294 5.1035 6.5161 3.8901 0.9311 6.6882 0.9030 0.9613 4.7468 5.0643 13.2257 10.4617 40.9067 0.5311 8.0779 3.4642 10.7551 2.4116 3.0543 13.0994 11.4378 20.2500 4.4580 1.8794 5.0215 12.8093 42.8099 84.5980 16.5866 33.5047 15.2431 32.9241 21.8525 72.8921 61.7052 38.2976 20.6789 59.2083 33.3048 4.6823 1.1191 25.2332 30.8771 17.2552 7.5630
temp: 298.150 k
press: 1.00000 atm
elementType: 35 8 6 6 6 6 6 6 6 6 6 6 6 6 6 6 6 1 1 1 1 1 1 1 1 1 1 1 1 1 1 1 1 1 1 1
symmnumber: 1
zpe: 789274.3 jmol-1
zpe.correction: 0.300619 hartree
zpe.thermalcorrener: 0.317606 hartree
zpe.thermalcorrenthalpy: 0.318550 hartree
zpe.thermalcorrgfe: 0.253776 hartree
zpe.sumelectzpe: -670.367435 hartree
zpe.sumelectthermal: -670.350448 hartree
zpe.sumelectthermalent: -670.349503 hartree
zpe.sumelectthermalfe: -670.414277 hartree
dipole: 2.0955 -3.4502 0.0422
dipole: 4.0369
quadrupole: -101.6327 -113.5344 -108.3634
quadrupole: 0.9976 4.1131 -3.2535
quadrupole: 6.2108 -5.6909 -0.5199 0.9976 4.1131 -3.2535
hfenergy: -670.6680535 hartree
pointgroup: C01 [X(C15H19Br1O1)]
dipole: 0.5869061 0.9896589 1.0948414 debye
polarizability: 218.6811657|6.4923308|163.3463966|-13.0154935|26.0243862|151.5164536 unknown
InChI: InChI=1S/C15H19BrO/c1-17-14-9-5-8-13(10-14)15(11-16)12-6-3-2-4-7-12/h2-4,6-7,11,13-14H,5,8-10H2,1H3
charge 0 multiplicity 1
36 atoms
Br -2.125199 -2.385508 -2.460243
O  4.330462 -0.10747 -1.119658
C  0.676824 0.030501 -0.09838
C  1.95874 -0.353533 -0.875245
C  3.197625 0.349326 -0.293862
C  0.848689 -0.308075 1.414002
C  3.378661 0.020832 1.204091
C  2.100873 0.384399 1.999442
C  -0.630546 -0.571288 -0.648611
C  -1.894879 -0.025235 -0.059437
C  -0.580088 -1.546131 -1.592454
C  5.561221 0.653226 -0.911178
C  -2.838616 -0.878495 0.572603
C  -2.156434 1.37122 -0.088674
C  -4.012488 -0.351103 1.153057
C  -3.334435 1.898548 0.484288
C  -4.266894 1.039308 1.110281
H  0.562118 1.13602 -0.164916
H  2.136735 -1.445695 -0.814235
H  1.86895 -0.09089 -1.945675
H  3.086923 1.455433 -0.411538
H  0.942489 -1.407845 1.522467
H  -0.053913 -0.001458 1.973599
H  4.249307 0.561315 1.621755
H  3.58533 -1.064084 1.297268
H  1.952104 1.484257 1.980074
H  2.22668 0.101531 3.06176
H  0.343122 -1.943047 -2.015364
H  6.003797 0.474768 0.090217
H  5.38988 1.744477 -1.037188
H  6.266687 0.304727 -1.682418
H  -2.646804 -1.955819 0.610297
H  -1.449429 2.046225 -0.585181
H  -4.727527 -1.02505 1.638085
H  -3.525924 2.976487 0.438251
H  -5.18004 1.447625 1.557521
