program: Gaussian 09
title: 000272582
version: EM64L-G09RevD.01
frameworkgroup: C1[X(C12H9NO3)]
method: RPBEPBE
basis: SDD
operation: Freq
keyword: #p
keyword: freq=noraman
keyword: PBEPBE/SDD
title: #p freq=noraman PBEPBE/SDD
converged: NO YES NO NO
title: Mulliken charges:
elementType: O O O N C C C C C C C C C C C C H H H H H H H H H
charge: -0.400122 -0.265321 -0.271341 -0.240234 -0.360403 0.087762 -0.522595 0.097686 0.001109 0.138682 0.138052 0.276581 -0.344211 -0.366161 -0.225424 -0.218901 0.262145 0.262115 0.265607 0.265633 0.280948 0.274680 0.237370 0.237869 0.388475
chargesum: 0.00000
title: Mulliken charges with hydrogens summed into heavy atoms:
elementType: O O O N C C C C C C C C C C C C
charge: -0.011648 -0.265321 -0.271341 -0.240234 0.163858 0.087762 0.008644 0.097686 0.001109 0.138682 0.138052 0.276581 -0.063263 -0.091480 0.012444 0.018469
polarizability: 2.42869754e+02 -4.27054763e+00 1.62482860e+02 1.40734915e-03 -2.31434284e-03 6.31298940e+01
1716.lowfreq: -9.7239 -9.6036 -0.0011 -0.0009 -0.0008 3.2421 64.8054 95.5020 111.3892
frequency: 64.8027 95.4976 111.3863 135.6543 176.4762 195.5321 244.6238 248.9573 325.0357 359.5788 366.9235 427.8376 428.7884 460.1888 473.4711 509.4675 552.0587 581.9942 648.8563 663.5002 679.7659 685.6414 690.1328 777.6571 787.8471 793.8844 821.2741 859.7295 862.9513 909.5794 990.7559 991.4664 1006.3413 1012.5058 1028.9431 1031.6002 1054.8278 1097.2153 1166.0423 1168.1063 1176.5651 1204.7592 1208.4968 1258.8080 1273.0595 1278.7540 1299.1907 1340.2696 1379.9424 1391.2594 1427.0450 1441.2799 1448.5235 1483.8481 1498.3978 1547.2741 1576.4541 1584.1175 1618.8109 1637.8025 3022.3604 3031.3974 3073.2398 3091.9918 3118.9480 3137.8665 3152.2101 3165.0955 3174.9854
redmass: 3.1107 3.2694 3.7505 5.8431 5.5397 7.0154 5.0048 5.7264 8.4607 6.5027 8.0791 7.6512 3.4349 4.4157 8.3363 7.5834 3.0108 7.1010 6.3804 3.8969 6.0910 3.6740 7.2689 1.1651 2.4329 1.5925 1.5579 6.0518 7.6384 1.4488 1.3734 3.1069 5.2509 1.3438 2.5688 1.8785 4.0024 2.5060 1.8163 1.2073 1.3882 1.0765 2.3984 1.5523 2.1879 1.9487 2.7906 2.2324 2.6659 8.3002 2.2045 1.2446 2.3358 1.5363 2.1858 6.7815 9.6391 5.2554 6.8044 8.3355 1.0592 1.0615 1.1049 1.1042 1.0682 1.0863 1.0901 1.0953 1.0999
irintensity: 2.6208 6.4509 0.8856 0.7308 2.2155 3.7383 0.0153 9.2662 6.9011 4.2000 0.2005 2.1254 3.0294 0.0276 1.8082 15.9934 8.0141 8.6382 0.6694 8.4604 16.6852 22.4616 11.7523 82.0484 71.0314 39.7010 15.0353 2.7376 4.2138 0.0468 3.5169 9.5623 1.6738 0.3770 6.4659 2.1358 74.1097 6.9335 2.7131 0.2025 8.6038 0.0934 0.7628 4.0559 154.2842 59.7384 113.9675 61.3449 195.9737 47.4672 48.9059 2.9521 13.5534 49.2049 18.8814 63.6386 380.4300 279.3891 5.0960 57.7252 8.6420 13.8747 0.8363 13.4949 87.9647 4.4131 6.7058 6.0272 21.0344
temp: 298.150 k
press: 1.00000 atm
elementType: 8 8 8 7 6 6 6 6 6 6 6 6 6 6 6 6 1 1 1 1 1 1 1 1 1
symmnumber: 1
zpe: 487655.6 jmol-1
zpe.correction: 0.185738 hartree
zpe.thermalcorrener: 0.197967 hartree
zpe.thermalcorrenthalpy: 0.198911 hartree
zpe.thermalcorrgfe: 0.147250 hartree
zpe.sumelectzpe: -742.021914 hartree
zpe.sumelectthermal: -742.009686 hartree
zpe.sumelectthermalent: -742.008742 hartree
zpe.sumelectthermalfe: -742.060403 hartree
dipole: 0.1068 -0.2517 0.0017
dipole: 0.2735
quadrupole: -74.8423 -104.4482 -92.4936
quadrupole: -12.5237 -0.0052 -0.0024
quadrupole: 15.7524 -13.8535 -1.8989 -12.5237 -0.0052 -0.0024
hfenergy: -742.2076526 hartree
pointgroup: C01 [X(C12H9N1O3)]
dipole: 0.0402889 0.0997532 -0.0006314 debye
dipolederiv: -0.3191494 0.2753268 0.0001572 -0.1132842 -1.1778098 -0.0000385 -0.0000386 -0.0002015 -0.367187 -1.0049946 0.1412739 0.0002354 0.8911874 -0.8857725 -0.0006056 0.0001638 -0.0000215 -0.3439485 -0.4161771 0.0276691 0.0000204 0.1708488 -1.2982169 -0.0004687 -0.0000277 -0.0001375 -0.3686952 -0.282754 0.5599152 0.0002037 -0.4489493 -0.6794196 -0.0001215 0.0000165 -0.0002029 -0.1347121 0.4212667 0.1140139 0.0000796 0.1334108 0.2260774 -0.0000096 -0.000161 -0.0000739 0.2733276 -1.6763572 -0.2510247 0.0001646 0.1985265 0.191188 0.0001418 0.0002369 0.0000382 -0.0018497 -0.2446982 -0.2570143 -0.0001721 -0.205258 -0.3184313 -0.0002222 -0.0003437 -0.0003876 0.0932501 2.0350316 0.0106797 -0.0003467 -0.4669742 0.9397858 0.0007302 0.0000176 0.0004366 0.1337863 0.4768662 -0.2971324 -0.0001239 -0.1980607 1.5102272 0.0005777 0.0000712 0.0003575 0.169159 0.6626312 -0.2958101 -0.0001708 0.1965829 0.997636 -0.0000038 0.0001551 0.0001365 0.0943397 0.0898916 -0.2395443 -0.0000875 -0.1299985 -0.2266789 -0.000078 -0.000059 -0.0000814 0.0049856 0.0506617 0.1799323 0.0000327 0.1518665 -0.0967628 -0.0000289 0.0000678 0.0000052 0.0120937 -0.3085342 0.0916905 0.0000543 -0.1665631 0.0706069 0.0000662 -0.0000685 0.0000527 -0.1075881 -0.1875606 -0.1054062 -0.0000312 0.013757 0.0591261 0.000059 -0.0000659 0.0000864 -0.1265878 0.1425982 -0.1420931 -0.0000448 0.0729797 -0.0596899 0.0000065 0.0000377 0.0000152 -0.144943 0.1545345 0.1303898 0.0000398 0.0793704 0.0450056 0.0000609 0.0000334 0.0000615 -0.137321 0.014074 0.005787 -0.006957 -0.0369512 0.0184584 0.0666454 0.033564 0.0876438 -0.0266193 0.0140163 0.0057407 0.0069541 -0.036964 0.018645 -0.0665783 -0.033604 -0.0875985 -0.0269071 0.0461003 0.0304108 0.0695414 -0.0070273 0.0788833 0.0043629 0.1112418 0.0074956 0.006834 0.0461771 0.0305353 -0.0694597 -0.0069537 0.0788083 -0.0042677 -0.1112058 -0.0073888 0.006905 0.1152952 -0.0137611 -0.0000028 0.0554932 0.0074019 -0.0000514 0.0000098 -0.0000525 0.1551737 0.1071303 0.0405716 0.0000128 -0.0017527 -0.0151366 -0.0000574 0.0000322 -0.0000559 0.1612932 -0.0534943 -0.0975397 -0.0000334 -0.1126248 0.0177346 -0.0000456 -0.0000407 -0.0000566 0.1565748 -0.0970242 0.058549 0.0000151 0.0700479 0.067639 -0.0000274 0.0000156 -0.0000178 0.1574233 0.214469 -0.0031596 -0.0000811 -0.1027095 0.4306948 -0.0000462 -0.0000484 -0.0000524 0.3612128 unknown
polarizability: 242.6948078|5.680696|162.6577939|-0.0083277|0.0332853|63.1299056 unknown
InChI: InChI=1S/C12H9NO3/c14-9-5-6-13-10(9)11(15)7-3-1-2-4-8(7)12(13)16/h1-4,15H,5-6H2
charge 0 multiplicity 1
25 atoms
O  -0.525578 2.611175 -0.004023
O  -3.189295 1.816865 -0.003347
O  0.333966 -2.910641 -0.005556
N  -1.076185 -1.051898 -0.00494
C  -2.365059 -1.809154 -0.005407
C  -1.294333 0.330085 -0.004401
C  -3.467581 -0.705347 -0.004691
C  -2.707433 0.629791 -0.003613
C  0.189778 -1.644913 -0.005402
C  -0.256744 1.257133 -0.004292
C  1.314552 -0.65809 -0.004884
C  1.105246 0.768337 -0.004423
C  2.639753 -1.160018 -0.005003
C  2.224106 1.649046 -0.004121
C  3.736725 -0.279909 -0.004691
C  3.527218 1.127193 -0.004258
H  -2.402232 -2.460955 0.883821
H  -2.402255 -2.459645 -0.8956
H  -4.120757 -0.761756 0.8836
H  -4.120841 -0.760584 -0.892997
H  2.770964 -2.247061 -0.005384
H  2.042382 2.72798 -0.00378
H  4.386997 1.805585 -0.00402
H  4.756839 -0.678256 -0.004806
H  -1.534032 2.732036 -0.004283
