program: Gaussian 09
title: 000272602
version: EM64L-G09RevD.01
frameworkgroup: C1[X(C14H19N3O4)]
method: RPBEPBE
basis: SDD
operation: Freq
keyword: #p
keyword: freq=noraman
keyword: PBEPBE/SDD
title: #p freq=noraman PBEPBE/SDD
converged: YES YES NO NO
title: Mulliken charges:
elementType: O O O O N N N C C C C C C C C C C C C C C H H H H H H H H H H H H H H H H H H H
charge: -0.289367 -0.450530 -0.455833 -0.431518 -0.222412 -0.073872 -0.169818 -0.166525 -0.187783 -0.139325 -0.079322 -0.366632 0.285284 0.202409 -0.006657 -0.339596 -0.340353 -0.282324 -0.617388 -0.655544 -0.228836 0.283481 0.277207 0.285917 0.245696 0.214372 0.227671 0.349131 0.357817 0.287881 0.248571 0.352230 0.223704 0.210804 0.230877 0.250700 0.292596 0.224217 0.227953 0.225118
chargesum: 0.00000
title: Mulliken charges with hydrogens summed into heavy atoms:
elementType: O O O O N N N C C C C C C C C C C C C C C
charge: -0.289367 -0.101399 -0.098016 -0.079289 -0.222412 -0.073872 -0.169818 0.116956 0.089424 0.146592 0.166374 0.075411 0.285284 0.202409 -0.006657 -0.051715 -0.091782 -0.058620 0.074993 0.089222 -0.003718
polarizability: 2.05305181e+02 8.86896196e+00 2.35384482e+02 2.90395922e+00 8.12123120e+00 1.21356132e+02
1716.lowfreq: -13.0767 -8.4664 -0.0007 -0.0007 0.0005 9.2231 38.8625 43.1058 58.5158
frequency: 38.6762 42.9924 58.4858 71.9084 80.7500 96.4029 110.6605 122.8271 142.7592 177.2463 181.1279 200.8410 222.1512 229.9714 248.1954 261.4102 266.4713 321.3639 326.8740 340.4305 347.7108 360.3138 385.2129 405.4800 442.9476 453.2264 476.8127 493.8809 504.5277 551.1079 581.3365 601.0232 622.6133 626.3287 650.3828 702.3842 712.6582 749.6769 768.8498 772.6155 831.5128 838.4276 867.3579 878.5173 883.9617 910.9084 944.5664 966.2508 976.1821 977.0066 996.2049 1008.9806 1017.6287 1028.8909 1041.7016 1057.0985 1062.0796 1080.5826 1093.5865 1098.2522 1131.5213 1142.5924 1171.6784 1175.6332 1178.7848 1185.0575 1209.3651 1212.6562 1247.8570 1251.8946 1267.6795 1276.7406 1284.6210 1297.0207 1305.1123 1313.9237 1338.8806 1354.9779 1358.5305 1377.8868 1382.8260 1407.5378 1417.6346 1428.4923 1443.4886 1452.8338 1459.1108 1464.1991 1464.6835 1474.0678 1481.0294 1495.6376 1551.1758 1593.7813 1622.5305 2939.2641 2957.5185 2978.8218 3001.8524 3012.6470 3024.2483 3041.7779 3051.6842 3060.3609 3088.1601 3110.8208 3119.1468 3128.6454 3140.1690 3154.7125 3169.5407 3532.5864 3563.1025 3588.8068
redmass: 5.3036 5.1470 4.2300 3.7262 3.8235 4.1162 4.8559 3.4971 3.4695 1.3063 2.3959 1.8832 4.4520 2.8531 2.8194 4.2062 3.5315 1.8856 1.6740 1.8792 4.7141 1.5978 4.2783 3.4951 1.5733 2.2976 4.5544 4.4867 4.2002 4.6237 4.0523 6.8064 5.4934 6.0414 4.9971 7.6275 6.5980 1.7726 3.9928 2.7826 3.2098 6.0923 1.4578 5.7284 3.0890 5.3921 1.3674 3.1165 3.4257 1.3512 2.9168 3.5807 3.0899 3.2872 2.8220 1.6518 2.4463 3.1355 1.2295 1.8390 1.5142 1.4302 1.1884 1.1643 1.4813 1.9869 1.3366 2.0444 2.9080 1.6014 1.2897 2.1912 1.4255 1.5698 1.3428 1.4768 2.4388 1.4077 2.2578 1.3087 1.3889 2.9945 1.5202 1.1690 1.2828 2.6422 1.1155 1.0872 2.8670 1.0938 1.0547 1.0840 3.7812 6.5290 7.3995 1.0459 1.0426 1.0682 1.0837 1.0853 1.0862 1.0891 1.0929 1.0861 1.0966 1.1002 1.0996 1.0858 1.0914 1.0955 1.0990 1.0651 1.0664 1.0665
irintensity: 0.5390 1.2729 0.2378 4.2394 2.2393 1.4053 7.3135 1.5514 5.3242 0.9157 1.0927 2.7216 3.8389 3.9636 4.5620 8.4118 2.9160 55.8788 92.8356 54.0221 17.5603 91.5418 7.2878 13.4418 149.6386 65.9479 1.5242 5.6385 10.8100 13.1004 0.9252 2.5541 13.6521 5.8183 8.2312 1.1770 23.2416 57.2709 51.1470 23.7612 55.9902 20.2038 4.6496 20.6062 11.0141 135.9938 7.0761 118.2504 41.6158 4.6997 96.2649 7.0895 27.5031 43.7465 12.4654 30.8922 21.4656 3.5601 9.6834 56.4865 14.1220 24.5293 29.9235 21.0540 25.8290 9.3777 21.8834 20.8205 71.0109 7.5771 6.4498 55.2091 7.4183 15.1879 22.1447 3.3431 107.7708 35.0182 35.2798 15.6574 11.9663 1.3829 3.2214 18.1047 52.5150 67.9872 19.3396 7.6393 7.5181 5.9890 40.7101 7.7211 295.6839 22.7207 20.8903 95.7331 106.7159 38.6601 28.1513 13.2667 12.8051 32.5214 32.9966 7.9264 14.7953 4.6849 17.6842 5.2127 6.9247 12.6355 24.7875 6.3198 11.1976 15.4668
temp: 298.150 k
press: 1.00000 atm
elementType: 8 8 8 8 7 7 7 6 6 6 6 6 6 6 6 6 6 6 6 6 6 1 1 1 1 1 1 1 1 1 1 1 1 1 1 1 1 1 1 1
symmnumber: 1
zpe: 844537.5 jmol-1
zpe.correction: 0.321667 hartree
zpe.thermalcorrener: 0.341965 hartree
zpe.thermalcorrenthalpy: 0.342910 hartree
zpe.thermalcorrgfe: 0.273103 hartree
zpe.sumelectzpe: -1008.413257 hartree
zpe.sumelectthermal: -1008.392959 hartree
zpe.sumelectthermalent: -1008.392015 hartree
zpe.sumelectthermalfe: -1008.461822 hartree
dipole: 0.0819 0.7790 1.8964
dipole: 2.0518
quadrupole: -143.1925 -109.9063 -119.0738
quadrupole: -8.2611 0.4133 -1.4534
quadrupole: -19.1350 14.1512 4.9838 -8.2611 0.4133 -1.4534
hfenergy: -1008.7349246 hartree
pointgroup: C01 [X(C14H19N3O4)]
dipole: 0.1602194 0.3801896 0.6938618 debye
polarizability: 209.5069026|13.7382378|231.0767545|-5.9777364|-6.9953346|121.4621376 unknown
InChI: InChI=1S/C14H19N3O4/c1-16(2)14-15-8-5-3-4-6-9(8)17(14)13-12(20)11(19)10(7-18)21-13/h3-6,10-13,18-20H,7H2,1-2H3
charge 0 multiplicity 1
40 atoms
O  1.826525 0.626237 -0.851216
O  2.429994 0.387116 2.453275
O  2.516361 -2.557083 0.711925
O  4.591106 0.236939 -1.330991
N  -0.399746 0.572662 0.171843
N  -2.597986 1.270147 0.053705
N  -0.86761 2.984239 -0.024973
C  1.028787 0.744038 0.399985
C  1.655416 -0.277478 1.399234
C  2.661821 -1.109357 0.560824
C  2.367195 -0.759184 -0.911559
C  3.594983 -0.716601 -1.823432
C  -1.193897 -0.606092 0.210946
C  -1.313769 1.662789 0.038153
C  -2.552417 -0.137933 0.169468
C  -0.884722 -1.982791 0.256554
C  -3.624445 -1.055144 0.201982
C  -1.973677 -2.885304 0.287879
C  -1.875626 4.006384 0.331183
C  0.015209 3.388089 -1.152123
C  -3.32129 -2.432514 0.26297
H  1.176769 1.78016 0.747322
H  0.879505 -0.929969 1.840204
H  3.678698 -0.761531 0.831289
H  1.607701 -1.455819 -1.320192
H  3.280166 -0.465855 -2.857144
H  4.087159 -1.703056 -1.825966
H  1.815789 0.797745 3.113373
H  2.95532 -2.843738 1.550535
H  0.139397 -2.370103 0.267413
H  -4.656057 -0.691926 0.16892
H  4.114173 1.095079 -1.180845
H  -1.76719 -3.960591 0.32616
H  -1.354807 4.961292 0.523958
H  -2.621243 4.15592 -0.477181
H  -2.417966 3.6945 1.236462
H  0.672862 2.559154 -1.454902
H  -0.587528 3.691713 -2.035427
H  0.641004 4.24455 -0.843652
H  -4.134563 -3.166184 0.283641
