program: Gaussian 09
title: 000026226
version: EM64L-G09RevD.01
frameworkgroup: C1[X(C13H19NO3)]
method: RPBEPBE
basis: SDD
operation: Freq
keyword: #p
keyword: freq=noraman
keyword: PBEPBE/SDD
title: #p freq=noraman PBEPBE/SDD
converged: YES YES NO NO
title: Mulliken charges:
elementType: O O O N C C C C C C C C C C C C C H H H H H H H H H H H H H H H H H H H
charge: -0.473119 -0.441744 -0.490110 -0.324777 -0.026411 -0.480158 -0.443434 -0.423182 -0.431066 -0.426117 -0.195451 0.469452 -0.497035 -0.400328 0.196333 -0.345853 0.127278 0.190925 0.209415 0.207925 0.217897 0.219025 0.208340 0.215426 0.216792 0.207662 0.243004 0.174110 0.247264 0.195353 0.304310 0.248473 0.335665 0.215903 0.379524 0.368709
chargesum: 0.00000
title: Mulliken charges with hydrogens summed into heavy atoms:
elementType: O O O N C C C C C C C C C C C C C
charge: -0.137454 -0.062220 -0.121401 -0.081773 0.164515 -0.062818 -0.006512 0.000584 -0.006612 -0.004743 -0.000099 0.469452 -0.192725 -0.151855 0.196333 -0.129951 0.127278
polarizability: 1.83423598e+02 -1.41378999e+01 1.61215483e+02 1.99346910e+01 1.08171045e+01 1.23648687e+02
1716.lowfreq: -36.7600 -10.5837 -6.8520 -0.0001 0.0004 0.0005 4.3864 11.9161 24.3598
frequency: -36.6815 7.0428 23.7850 37.4321 84.2595 91.0951 131.2649 171.1764 183.9597 194.3846 225.0677 254.0243 263.6092 280.8209 290.2074 311.1638 356.7882 399.6849 434.3645 451.5721 474.7742 483.0771 494.5905 534.7290 563.5710 585.2272 619.4014 628.2908 673.0061 704.7575 720.6854 754.8891 760.3030 782.7941 811.3905 862.5525 892.1728 893.1599 909.9334 915.3803 948.5248 967.6570 971.8240 979.9946 988.3557 1037.3913 1050.3641 1071.1961 1073.7229 1116.0417 1128.6510 1145.1791 1154.3805 1169.0460 1173.1556 1180.3190 1191.7133 1197.0783 1216.2448 1232.2677 1233.1878 1269.2281 1270.0337 1273.8434 1284.5190 1294.0244 1300.0193 1305.7370 1314.7402 1343.2330 1359.5956 1386.6983 1408.2545 1455.7467 1463.0677 1465.7237 1470.0821 1473.6341 1475.1627 1491.8242 1501.7494 1610.4250 1632.0865 2804.0850 2838.2048 2916.6650 2985.1334 2994.8671 2999.3454 3013.6755 3039.9310 3053.5291 3058.9884 3065.1929 3081.2305 3116.8840 3166.8905 3192.3248 3417.8638 3527.5569 3560.5838 3623.6750
redmass: 1.5760 4.9992 4.2516 2.9198 4.1604 4.5610 3.6322 2.2502 5.7254 4.2457 3.5473 1.1516 1.3380 4.3420 3.6987 3.5556 4.8878 3.6438 2.8078 2.4980 4.1458 1.1108 3.1495 4.3062 4.8132 5.0966 2.8123 3.3578 1.4271 4.5769 3.5793 1.2139 5.2954 1.4164 1.5147 3.4418 2.3795 1.5112 2.7771 1.3814 1.5865 1.4882 1.6778 1.9741 5.8892 3.5007 2.7607 2.3119 2.4270 1.6668 1.9800 1.2234 2.4992 1.4679 1.5291 1.4053 1.3357 1.2510 1.3700 1.6776 1.2652 1.3288 2.4314 1.2326 1.1564 1.2773 1.3301 1.4164 1.4365 1.4563 1.5938 1.6614 4.8980 1.2710 1.2227 1.4465 1.4897 1.1050 1.0960 1.1008 3.2709 7.2884 6.7598 1.0718 1.0813 1.0833 1.0584 1.0601 1.0615 1.0666 1.1004 1.1021 1.0897 1.1011 1.1047 1.0897 1.0940 1.0918 1.0739 1.0648 1.0658 1.0665
irintensity: 0.0062 0.0457 1.3559 0.1446 1.3573 3.8493 2.4401 5.2147 2.8924 5.1466 6.2659 113.9518 152.1080 14.4706 37.0965 16.3551 4.9403 12.4608 4.4651 21.9455 8.1071 129.7276 21.8013 11.0621 5.7330 3.6666 3.7367 23.8804 63.1075 4.1174 6.6765 8.2561 47.1088 46.8850 1.6300 0.4991 4.5267 10.5818 25.4096 10.1977 6.4634 20.1632 2.3729 20.7704 68.5961 19.8217 4.9178 158.0694 8.5159 50.6670 56.7529 13.2851 32.7432 2.3865 15.7481 42.1958 41.4718 30.3090 9.1502 47.3768 8.2418 3.6625 104.4227 10.4014 1.7642 4.0259 2.4049 116.4536 0.9059 16.2384 56.6239 25.1075 5.4606 12.0363 3.4731 1.7522 4.9655 5.8646 10.4164 5.2414 126.2212 36.8683 2.5027 147.2475 125.0924 54.7390 29.1668 34.9862 60.5648 41.5509 30.7818 9.5808 7.6745 21.7286 96.9694 17.4555 5.2734 2.3110 1.6520 75.9271 3.2258 47.9511
temp: 298.150 k
press: 1.00000 atm
elementType: 8 8 8 7 6 6 6 6 6 6 6 6 6 6 6 6 6 1 1 1 1 1 1 1 1 1 1 1 1 1 1 1 1 1 1 1
symmnumber: 1
zpe: 788271.7 jmol-1
zpe.correction: 0.300237 hartree
zpe.thermalcorrener: 0.316897 hartree
zpe.thermalcorrenthalpy: 0.317841 hartree
zpe.thermalcorrgfe: 0.253341 hartree
zpe.sumelectzpe: -785.866331 hartree
zpe.sumelectthermal: -785.849671 hartree
zpe.sumelectthermalent: -785.848727 hartree
zpe.sumelectthermalfe: -785.913228 hartree
dipole: -3.9841 -1.4470 -1.9317
dipole: 4.6581
quadrupole: -105.2437 -87.1295 -101.7851
quadrupole: -16.8361 -4.1552 2.9699
quadrupole: -7.1909 10.9233 -3.7323 -16.8361 -4.1552 2.9699
hfenergy: -786.1665681 hartree
pointgroup: C01 [X(C13H19N1O3)]
dipole: 1.4360605 0.3692882 -1.0770056 debye
polarizability: 177.7527991|-20.8089979|154.6856503|-22.8405984|-15.2323626|135.8493183 unknown
InChI: InChI=1S/C13H19NO3/c15-11-6-5-9(7-12(11)16)13(17)8-14-10-3-1-2-4-10/h5-7,10,13-17H,1-4,8H2
charge 0 multiplicity 1
36 atoms
O  -0.891285 -3.096073 1.099934
O  -4.182636 0.484063 1.882258
O  -4.023413 2.272627 -0.136539
N  1.834898 -1.117493 -0.573598
C  3.073244 -0.387147 -0.220831
C  3.823569 0.1084 -1.480494
C  2.812973 0.931016 0.554067
C  4.772543 1.226759 -0.96025
C  4.122014 1.750583 0.36953
C  1.093567 -1.721169 0.546801
C  -0.341479 -2.15097 0.11444
C  -1.313302 -0.981102 0.010766
C  -2.313579 -0.794609 0.995539
C  -1.204944 -0.062705 -1.062798
C  -3.190323 0.301172 0.90941
C  -2.084936 1.04146 -1.151105
C  -3.073647 1.218623 -0.166565
H  3.772592 -1.020202 0.38541
H  3.071655 0.524326 -2.179256
H  4.366113 -0.69952 -2.006492
H  2.564604 0.774736 1.61898
H  1.950982 1.435204 0.077064
H  4.891061 2.030653 -1.708128
H  5.78182 0.821265 -0.762746
H  4.80727 1.586245 1.221481
H  3.914149 2.834478 0.33096
H  2.006355 -1.803101 -1.32335
H  1.611388 -2.624069 0.971685
H  1.010369 -0.985303 1.364863
H  -0.261502 -2.65287 -0.877645
H  -2.418388 -1.509216 1.814277
H  -0.41635 -0.193065 -1.80906
H  -0.212908 -3.793086 1.287142
H  -1.997675 1.751426 -1.983714
H  -4.705166 1.296779 1.651168
H  -3.918138 2.879383 -0.907208
