program: Gaussian 09
title: 000272570
version: EM64L-G09RevD.01
frameworkgroup: C1[X(C9H9N3O4)]
method: RPBEPBE
basis: SDD
operation: Freq
keyword: #pfreq=noraman
keyword: PBEPBE/SDD
title: #p freq=noraman PBEPBE/SDD
converged: YES YES NO NO
title: Mulliken charges:
elementType: O O O O N N N C C C C C C C C C H H H H H H H H H
charge: -0.397630 -0.273106 -0.205606 -0.203301 -0.341190 -0.091301 0.019661 -0.261898 0.426158 -0.504855 0.222574 -0.484810 -0.338515 0.381450 -0.196849 -0.366865 0.273312 0.306098 0.257003 0.264002 0.330475 0.271242 0.242233 0.289912 0.381804
chargesum: 0.00000
title: Mulliken charges with hydrogens summed into heavy atoms:
elementType: O O O O N N N C C C C C C C C C
charge: -0.015826 -0.273106 -0.205606 -0.203301 -0.035092 -0.091301 0.019661 0.011415 0.426158 0.016150 0.222574 -0.154335 -0.067272 0.381450 0.045384 -0.076953
polarizability: 1.60734137e+02 -2.12825472e-03 1.48172232e+02 -6.97343941e+00 2.54957501e+00 8.57363807e+01
1716.lowfreq: -3.3555 -0.0005 0.0002 0.0008 4.6220 10.1771 26.5233 46.5741 59.0622
frequency: 26.4961 46.5580 59.0601 97.5285 151.7591 153.8907 173.0529 200.6228 250.6500 272.3207 315.9819 359.9045 385.8410 406.6776 427.6062 458.1136 491.6176 531.3974 556.5765 587.2983 600.9030 649.3253 654.6862 681.0266 697.8617 705.5934 757.4471 810.3854 842.7211 878.8605 932.6446 947.3891 977.6822 990.2303 1002.0551 1015.5488 1023.9999 1069.3601 1079.3879 1087.3390 1109.0352 1174.9173 1180.4353 1199.9929 1223.3300 1234.6431 1271.1219 1297.5661 1322.0008 1336.6855 1372.1509 1401.0444 1427.3813 1432.7014 1439.9981 1463.1872 1476.3241 1589.7237 1616.4143 1621.9405 3007.9027 3027.1527 3082.5214 3149.8673 3169.0588 3182.1008 3187.6484 3274.2706 3506.2291
redmass: 7.0767 8.7738 8.7769 5.3766 5.0700 6.0330 3.9481 4.5127 5.6663 5.0684 5.3563 4.8563 4.3921 1.4277 3.2191 4.9579 5.4496 4.1676 3.5819 2.7031 8.3731 6.2671 7.0144 3.4585 2.2827 4.8835 7.8720 1.8090 2.7811 4.4199 2.1397 1.5317 1.4431 5.4585 1.3696 2.0013 7.1597 2.1368 3.0065 2.2786 2.9357 1.1831 1.1694 3.3623 5.2735 1.5547 1.3574 1.4845 1.8288 1.5960 10.4946 5.6984 1.5851 1.6832 1.7216 1.0853 2.6565 6.9343 6.9081 10.3042 1.0643 1.0869 1.1002 1.0880 1.0945 1.0914 1.0969 1.0648 1.0770
irintensity: 2.3132 0.3708 0.8221 5.0848 0.5737 0.3988 4.1307 6.6164 29.8205 3.8344 12.8421 3.3607 38.6692 85.7842 1.5120 0.9077 6.7686 4.3229 16.7122 51.9157 7.4039 8.9369 8.2898 93.3346 74.2079 7.9828 1.5115 29.2024 15.1366 11.1180 13.0193 1.3564 14.8999 1.2616 0.6404 0.4607 11.3969 15.1004 38.8468 51.5295 17.9732 1.6996 22.7048 117.3883 182.1208 29.7190 7.7393 25.6437 28.5630 23.1885 111.3675 5.0451 49.4414 16.4630 53.0264 12.0372 26.1142 8.5177 7.5280 271.6383 23.9272 19.4416 10.5892 6.2125 3.6009 7.6661 4.8660 33.1146 11.0110
temp: 298.150 k
press: 1.00000 atm
elementType: 8 8 8 8 7 7 7 6 6 6 6 6 6 6 6 6 1 1 1 1 1 1 1 1 1
symmnumber: 1
zpe: 473330.9 jmol-1
zpe.correction: 0.180282 hartree
zpe.thermalcorrener: 0.194110 hartree
zpe.thermalcorrenthalpy: 0.195054 hartree
zpe.thermalcorrgfe: 0.138285 hartree
zpe.sumelectzpe: -812.200604 hartree
zpe.sumelectthermal: -812.186776 hartree
zpe.sumelectthermalent: -812.185832 hartree
zpe.sumelectthermalfe: -812.242601 hartree
dipole: 2.9764 2.2908 -3.2864
dipole: 4.9907
quadrupole: -114.7226 -86.3040 -91.6887
quadrupole: -13.5275 -8.4215 4.8975
quadrupole: -17.1509 11.2678 5.8831 -13.5275 -8.4215 4.8975
hfenergy: -812.3808857 hartree
pointgroup: C01 [X(C9H9N3O4)]
dipole: 0.9635011 1.6187548 -0.5536885 debye
dipolederiv: -0.4474452 -0.0585131 -0.0537685 -0.0333682 -0.3521886 -0.1153467 -0.0099472 -0.33408 -0.3937349 -0.6480421 0.2112217 -0.2309893 0.214595 -0.5333337 0.0484947 -0.5749299 0.3191912 -0.8552948 -0.8690655 -0.1289861 0.112772 -0.1979791 -0.4471133 -0.0826267 0.1140163 -0.0819804 -0.313228 -0.4900382 -0.0212182 0.0704384 -0.0423165 -0.666776 -0.2777376 0.0690266 -0.2558934 -0.4071947 -0.5265011 0.0895305 -0.2015768 0.087528 -0.4103088 -0.2260845 -0.1103045 -0.0514862 -0.5227039 -0.5018428 0.0221786 -0.0540306 0.4429486 -0.5286307 0.3890504 -0.2075725 0.5198754 -0.1440525 1.2799147 0.3780542 -0.1155893 0.5018571 1.1799327 0.4760818 -0.0997227 0.4481082 0.4971122 1.0084147 -0.0224436 0.0160802 -0.1097448 0.3405021 0.0243867 0.1185127 -0.0918568 0.6536186 0.0793071 0.0093875 -0.0459474 -0.0387314 -0.1949066 -0.0663879 -0.1033394 -0.0411837 -0.2038882 0.2402851 -0.033519 -0.025542 -0.0841705 0.246801 -0.1903672 0.0267915 -0.2256756 0.0264512 0.5432461 -0.3526064 0.3826251 -0.6887397 0.8830731 -0.3255857 0.608487 -0.3318808 0.8134578 -0.0857989 0.1952823 0.0654442 0.0141126 -0.012529 0.0317884 0.0108661 -0.0254404 -0.0636747 0.068843 0.105216 0.015145 0.0460711 0.0430536 0.0730376 0.0549667 0.0814627 -0.0380295 -0.1373843 -0.2328654 -0.0780961 -0.3222865 -0.2958343 -0.1284966 -0.1160445 -0.1286461 0.0122661 -0.2265286 -0.1460171 -0.079738 -0.168557 0.0084194 0.1191354 -0.0570775 0.1462125 -0.0278544 -0.0648071 -0.0322617 -0.0578675 0.2375745 0.0515164 0.0317256 0.1184627 0.0993122 -0.0640829 -0.0465304 -0.0138463 0.0351573 0.013829 -0.0513528 0.0959457 -0.0039573 0.0607044 0.0065253 0.1027289 0.0131724 0.1430003 0.025013 0.120259 0.094327 0.039053 0.0386059 0.2309548 -0.0414405 0.0908186 0.0582451 0.0661886 0.0709665 0.0012772 0.0529066 -0.0448518 0.0436077 0.0480834 -0.1108667 0.0085861 -0.0372595 -0.0302074 0.0692385 -0.0075167 0.061476 0.0293018 0.214714 0.0115143 0.0088957 0.0353814 0.0975125 -0.0270719 0.0117112 -0.0262181 0.1324808 0.0833669 -0.0917007 -0.0026234 -0.0662256 0.0535376 -0.0320988 -0.0229195 -0.0402783 0.1155039 0.050351 0.0401171 0.0504079 0.0363924 0.0012419 -0.0967524 0.0590618 -0.1020914 0.0780982 0.043508 0.00232 0.0461767 -0.0221959 0.1450178 -0.0064077 0.029104 -0.0156076 0.1518178 0.3226617 0.0760311 -0.067205 0.0900833 0.2813478 0.1204746 0.0003653 0.022222 0.2425421 unknown
polarizability: 160.3818842|5.1534024|133.0550291|-3.5481161|27.4276714|101.205837 unknown
InChI: InChI=1S/C9H9N3O4/c13-8-5-10-9(11(8)14)6-2-1-3-7(4-6)12(15)16/h1-4,9-10,14H,5H2
charge 0 multiplicity 1
25 atoms
O  2.362227 1.963385 1.327403
O  3.559828 -0.519815 1.557425
O  -4.157825 -1.345019 -0.322118
O  -2.397081 -2.242046 -1.459479
N  1.944978 -0.091054 -1.691581
N  2.476571 1.051391 0.221401
N  -2.933897 -1.319641 -0.733123
C  1.494778 1.083866 -0.914641
C  0.041677 0.995787 -0.428837
C  2.641231 -1.046464 -0.772404
C  2.985661 -0.21456 0.46863
C  -0.757773 -0.105911 -0.794832
C  -0.511787 2.031769 0.36837
C  -2.092585 -0.157413 -0.343824
C  -1.852642 1.956493 0.808285
C  -2.660956 0.855567 0.457177
H  1.640167 2.013921 -1.493248
H  2.516891 0.173416 -2.499922
H  3.545002 -1.472153 -1.238723
H  1.984748 -1.884412 -0.473082
H  -0.352354 -0.889443 -1.4400
H  0.108471 2.88737 0.653058
H  -2.268531 2.759238 1.425259
H  -3.702026 0.770678 0.779067
H  2.804727 1.445252 2.074438
