program: Gaussian 09
title: 000272566
version: EM64L-G09RevD.01
frameworkgroup: C1[X(C17H11NO4)]
method: RPBEPBE
basis: SDD
operation: Freq
keyword: #p
keyword: freq=noraman
keyword: PBEPBE/SDD
title: #p freq=noraman PBEPBE/SDD
converged: NO YES NO NO
title: Mulliken charges:
elementType: O O O O N C C C C C C C C C C C C C C C C C H H H H H H H H H H H
charge: -0.139656 -0.183443 -0.434526 -0.249846 -0.514100 0.274091 0.405413 0.279520 -0.550089 0.496888 -0.358109 -0.186455 -0.371004 0.038070 -0.248282 -0.232127 -0.572845 -0.375815 0.288297 -0.199298 -0.345095 0.115085 0.314984 0.285531 0.212485 0.293694 0.239534 0.275251 0.245939 0.285020 0.240822 0.281016 0.389046
chargesum: 0.00000
title: Mulliken charges with hydrogens summed into heavy atoms:
elementType: O O O O N C C C C C C C C C C C C C C C C C
charge: -0.139656 -0.183443 -0.045480 -0.249846 -0.199116 0.274091 0.405413 0.279520 -0.264558 0.496888 -0.145624 -0.186455 -0.077309 0.038070 -0.008748 0.013812 -0.297593 -0.090795 0.288297 0.041525 -0.064079 0.115085
polarizability: 3.62057760e+02 -6.94699592e+00 2.40054185e+02 -8.03628930e+00 -3.49511189e+00 1.00706658e+02
1716.lowfreq: -1.6932 -0.0007 -0.0005 0.0005 2.9589 7.1504 24.0329 32.5549 44.2369
frequency: 23.9761 32.5353 44.2322 60.8955 77.0458 108.2590 140.7377 152.2996 179.4605 193.0443 207.4925 234.6323 300.9688 318.0354 346.2312 373.8747 393.6986 404.7983 422.2547 447.5748 453.4746 493.0106 493.3745 515.1708 546.1567 562.0915 589.7267 594.7573 615.7146 635.5051 643.0806 678.7569 689.3911 701.5707 719.9977 731.7391 744.9368 777.0915 812.8121 831.5855 837.7151 885.8446 891.7267 906.1327 928.5421 945.4465 952.1597 975.1852 986.9081 1001.2693 1010.6419 1040.2920 1049.9169 1081.2197 1096.2921 1128.8927 1142.8675 1184.3811 1188.0108 1213.8311 1227.8199 1256.0863 1286.9891 1292.6331 1309.0737 1329.2404 1339.9058 1387.0558 1396.0465 1428.7715 1436.8490 1477.3945 1481.5757 1530.6197 1539.3495 1568.1916 1578.4316 1595.9237 1610.2700 1616.0881 1619.9759 1643.4754 3125.4235 3136.4556 3144.3364 3149.6557 3155.8108 3169.9674 3172.0147 3177.8319 3189.0344 3532.1738 3535.1387
redmass: 7.5067 7.0096 7.6782 9.8828 6.3887 4.4808 7.8391 5.5666 5.8161 4.8534 5.0541 5.2613 7.0529 4.6210 14.4860 7.7898 3.6713 7.6591 3.2467 4.5605 8.0598 3.4585 3.3696 3.9637 5.0460 1.6963 4.0814 4.6528 1.5940 5.7987 3.7740 4.8473 3.3248 5.4354 3.1533 3.4310 5.6420 1.5974 1.7477 2.2620 2.9970 1.5080 4.3304 2.1788 1.6084 1.7909 3.1239 1.4086 6.0160 1.3432 1.3773 3.1858 2.3196 2.8468 1.6949 1.7648 1.6071 1.1074 1.1068 2.5727 2.2690 1.8981 1.8984 1.8728 2.6700 2.1734 2.2056 9.6203 6.1196 3.0518 2.4376 2.7085 2.6657 2.2978 7.2112 6.9437 7.6256 4.8679 6.4466 6.6059 6.7087 8.7792 1.0872 1.0922 1.0885 1.0883 1.0936 1.0923 1.1006 1.0923 1.0971 1.0642 1.0749
irintensity: 2.2318 0.7675 0.6938 2.0071 0.6556 1.8560 1.8407 1.5119 1.3866 0.5098 0.7714 2.4207 8.0585 1.5741 3.6648 5.3623 1.8160 4.2154 5.0331 17.8217 0.4953 25.1564 4.1941 8.5279 17.5036 93.4149 34.7383 52.2661 99.5773 10.5833 4.8994 17.3131 1.6518 4.2926 21.9112 88.9464 0.8120 62.2741 25.4564 7.7720 1.6816 6.2739 38.9292 17.8055 18.6685 18.2725 27.5309 3.4631 3.8146 0.3057 1.0698 231.0364 95.2165 3.6308 10.9253 12.9147 101.0397 0.5760 3.0288 54.4262 3.7555 53.4754 13.3140 67.6412 1.4406 79.0344 165.3875 5.2160 22.2489 2.4346 7.4922 206.3123 19.2572 244.6159 405.4839 32.8582 189.4178 35.2899 121.8046 4.3816 59.0771 200.0309 11.5653 6.0358 7.8283 9.9005 4.2022 5.3840 22.4204 0.7234 2.4305 61.0503 24.9077
temp: 298.150 k
press: 1.00000 atm
elementType: 8 8 8 8 7 6 6 6 6 6 6 6 6 6 6 6 6 6 6 6 6 6 1 1 1 1 1 1 1 1 1 1 1
symmnumber: 1
zpe: 629109.4 jmol-1
zpe.correction: 0.239615 hartree
zpe.thermalcorrener: 0.257413 hartree
zpe.thermalcorrenthalpy: 0.258358 hartree
zpe.thermalcorrgfe: 0.192034 hartree
zpe.sumelectzpe: -1008.558454 hartree
zpe.sumelectthermal: -1008.540656 hartree
zpe.sumelectthermalent: -1008.539712 hartree
zpe.sumelectthermalfe: -1008.606036 hartree
dipole: -4.3203 6.0237 2.6179
dipole: 7.8615
quadrupole: -124.3339 -133.2515 -128.9206
quadrupole: 33.1538 2.2766 -3.6020
quadrupole: 4.5015 -4.4162 -0.0853 33.1538 2.2766 -3.6020
hfenergy: -1008.7980695 hartree
pointgroup: C01 [X(C17H11N1O4)]
dipole: 1.6452898 -2.498095 0.7867417 debye
polarizability: 361.6336931|-10.391724|238.2700395|8.3394611|17.4026118|102.9148707 unknown
InChI: InChI=1S/C17H11NO4/c19-15-9-14(12-6-1-2-7-13(12)16(15)20)18-11-5-3-4-10(8-11)17(21)22/h1-9,18,21H
charge 0 multiplicity 1
33 atoms
O  -4.777684 1.768936 -0.33742
O  -2.47666 3.4146 -0.299969
O  6.403443 -0.29855 -0.27312
O  5.06465 -1.855879 -1.357783
N  0.30932 -0.524477 0.06608
C  -2.126371 -0.790108 0.034536
C  -0.93514 0.106346 0.012948
C  -3.429929 -0.222946 -0.115562
C  -1.078549 1.485267 -0.080461
C  1.591716 0.034062 0.323872
C  -2.021295 -2.195151 0.212629
C  -3.62894 1.259178 -0.227023
C  -4.574254 -1.055676 -0.124877
C  -2.36519 2.150862 -0.194928
C  -3.1682 -3.018682 0.196664
C  -4.45103 -2.451763 0.018927
C  2.718283 -0.600991 -0.252352
C  1.788476 1.141185 1.195725
C  4.023553 -0.134045 0.027886
C  3.093657 1.606645 1.457623
C  4.219184 0.982035 0.879546
C  5.161638 -0.854676 -0.607458
H  0.325428 -1.507351 -0.21195
H  -0.205874 2.140077 -0.144091
H  -1.054267 -2.674525 0.402235
H  -5.551637 -0.575407 -0.239795
H  -3.059119 -4.099722 0.333177
H  2.604968 -1.456862 -0.928706
H  -5.339722 -3.090623 0.006898
H  0.934796 1.615738 1.686523
H  3.229486 2.459268 2.130704
H  5.23284 1.336884 1.080358
H  7.12212 -0.818646 -0.722835
