program: Gaussian 09
title: 000272556
version: EM64L-G09RevD.01
frameworkgroup: C1[X(C13H11ClN2)]
method: RPBEPBE
basis: SDD
operation: Freq
keyword: #p
keyword: freq=noraman
keyword: PBEPBE/SDD
title: #p freq=noraman PBEPBE/SDD
converged: YES YES NO NO
title: Mulliken charges:
elementType: Cl N N C C C C C C C C C C C C C H H H H H H H H H H H
charge: -0.059461 -0.060657 -0.092057 0.480810 -0.585850 -0.396432 -0.354298 -0.204132 -0.208110 -0.099747 0.160076 -0.336314 -0.286416 -0.204618 -0.201054 -0.233041 0.225387 0.227257 0.237549 0.252988 0.255823 0.255496 0.253267 0.276890 0.233232 0.230931 0.232483
chargesum: 0.00000
title: Mulliken charges with hydrogens summed into heavy atoms:
elementType: Cl N N C C C C C C C C C C C C C
charge: -0.059461 -0.060657 -0.092057 0.480810 -0.133206 -0.158882 -0.101310 0.051691 0.047386 -0.099747 0.160076 -0.083047 -0.009527 0.028613 0.029876 -0.000557
polarizability: 2.62197633e+02 1.77790354e+01 1.28165562e+02 1.79139852e+01 6.95015020e+00 1.28639923e+02
1716.lowfreq: -6.2091 -1.9904 -0.0013 0.0005 0.0011 7.6366 17.3524 22.4705 27.9422
frequency: 15.5239 22.2900 27.8162 95.1820 96.2964 144.7129 213.7446 218.1255 284.4959 300.0673 339.0228 386.1783 403.9096 407.1525 408.7473 454.8100 512.2624 528.2511 609.1436 623.7758 637.6698 650.2836 694.5461 721.0918 779.9690 795.6938 831.6891 835.8005 837.1509 857.7261 931.6733 948.1976 951.7487 969.4342 987.2762 990.1421 1000.4965 1004.2125 1016.3307 1023.7533 1071.0293 1076.5484 1111.1503 1146.6840 1171.3206 1184.3113 1184.8793 1202.5394 1214.7625 1296.1973 1303.2688 1312.3926 1377.2329 1390.0909 1393.9455 1414.5604 1444.5030 1452.8263 1466.5446 1477.7141 1587.7134 1588.9885 1599.1785 1604.5428 2975.3865 3056.4126 3129.7544 3134.3176 3137.2485 3140.7907 3153.2880 3165.0886 3169.1725 3172.1475 3172.4375
redmass: 4.2819 5.3565 4.9405 7.9783 5.9430 4.9412 5.8467 8.3827 6.0507 5.3438 4.3173 7.2059 2.8750 2.8897 2.9149 4.7877 3.1924 4.1251 6.4725 6.9158 4.9339 5.3930 1.9185 3.6784 1.9235 2.7549 1.2843 3.9606 1.8111 1.2446 3.2999 1.4373 1.4108 1.3659 6.2156 1.3754 4.3144 1.3261 2.0290 2.3796 2.7280 1.4845 1.3646 1.6500 1.0606 1.1332 1.3723 2.4929 1.7799 1.2680 1.3643 1.3415 7.8955 9.3428 3.0205 4.5130 2.1199 1.2321 2.2241 2.3427 6.2714 7.3842 6.1978 6.3394 1.0595 1.1020 1.0852 1.0900 1.0898 1.0887 1.0928 1.0958 1.0954 1.1006 1.0965
irintensity: 0.0077 0.2171 0.0855 0.4150 1.0865 3.8048 0.0724 1.1796 0.2224 0.5961 2.0350 14.2522 7.2206 1.3171 0.4712 12.0316 23.0584 8.2693 0.2297 0.3381 10.6018 8.3403 48.8095 8.0737 32.6786 49.5549 3.1179 5.3629 46.7306 0.0680 1.5910 7.3782 2.9639 0.1277 1.1561 0.0305 45.7828 0.9285 7.1116 3.2631 41.5976 10.2630 7.4364 44.1486 0.3017 1.1129 2.3226 0.8183 11.4576 1.9248 5.3048 3.0186 1.4109 4.4842 7.0541 9.7000 13.9236 17.0641 8.9771 76.8286 2.9017 1.5988 10.2197 1.7854 44.0689 9.8144 0.6682 9.1700 5.3216 9.0865 16.9712 15.2463 6.1799 27.4503 0.2618
temp: 298.150 k
press: 1.00000 atm
elementType: 17 7 7 6 6 6 6 6 6 6 6 6 6 6 6 6 1 1 1 1 1 1 1 1 1 1 1
symmnumber: 1
zpe: 538531.1 jmol-1
zpe.correction: 0.205116 hartree
zpe.thermalcorrener: 0.218903 hartree
zpe.thermalcorrenthalpy: 0.219847 hartree
zpe.thermalcorrgfe: 0.160808 hartree
zpe.sumelectzpe: -1070.379503 hartree
zpe.sumelectthermal: -1070.365716 hartree
zpe.sumelectthermalent: -1070.364772 hartree
zpe.sumelectthermalfe: -1070.423811 hartree
dipole: -2.4202 0.5876 0.0692
dipole: 2.4915
quadrupole: -96.9468 -96.9018 -94.1477
quadrupole: 11.4189 2.2042 2.6640
quadrupole: -0.9480 -0.9030 1.8511 11.4189 2.2042 2.6640
hfenergy: -1070.584619 hartree
pointgroup: C01 [X(C13H11Cl1N2)]
dipole: -0.9121177 -0.2806772 -0.2238434 debye
polarizability: 265.9012045|5.6966674|122.3911811|-11.2136209|2.0145787|130.7107321 unknown
InChI: InChI=1S/C13H11ClN2/c14-12-8-6-11(7-9-12)10-15-16-13-4-2-1-3-5-13/h1-9H,10H2
charge 0 multiplicity 1
27 atoms
Cl 5.414955 1.988762 1.284881
N  -0.414795 -0.889851 -0.778845
N  -1.336734 -1.130857 0.103563
C  1.962369 -0.7921 -0.09287
C  0.819863 -1.70381 -0.524324
C  3.076767 -0.557609 -0.934109
C  1.913554 -0.154988 1.173586
C  4.1344 0.286443 -0.523959
C  2.958786 0.691592 1.601259
C  4.055924 0.89723 0.741356
C  -2.551583 -0.364003 -0.063808
C  -3.581178 -0.66509 0.86219
C  -2.750295 0.632165 -1.059044
C  -4.812546 0.022192 0.796127
C  -3.980158 1.314515 -1.117103
C  -5.013701 1.012735 -0.19309
H  1.074197 -2.195608 -1.480865
H  0.612284 -2.472458 0.247168
H  3.126395 -1.034428 -1.919901
H  1.052142 -0.321819 1.830621
H  4.996247 0.463787 -1.173576
H  2.922226 1.180828 2.578904
H  -3.39341 -1.436653 1.616406
H  -1.937754 0.848645 -1.759681
H  -5.608986 -0.2113 1.51073
H  -4.141093 2.085177 -1.879307
H  -5.967576 1.549405 -0.245705
