program: Gaussian 09
title: 000272560
version: EM64L-G09RevD.01
frameworkgroup: C1[X(C17H13NO3)]
method: RPBEPBE
basis: SDD
operation: Freq
keyword: #p
keyword: freq=noraman
keyword: PBEPBE/SDD
title: #p freq=noraman PBEPBE/SDD
converged: YES YES NO NO
title: Mulliken charges:
elementType: O O O N C C C C C C C C C C C C C C C C C H H H H H H H H H H H H H
charge: -0.143301 -0.266661 -0.187773 -0.515674 0.272777 0.399719 0.276842 -0.541159 0.516602 -0.359918 -0.185977 -0.372705 0.035493 -0.250109 -0.233660 -0.511000 -0.475100 0.356077 -0.183803 -0.385604 -0.535209 0.308358 0.288247 0.211761 0.292873 0.237052 0.244070 0.300823 0.233906 0.228130 0.248178 0.250960 0.221388 0.224399
chargesum: 0.00000
title: Mulliken charges with hydrogens summed into heavy atoms:
elementType: O O O N C C C C C C C C C C C C C C C C C
charge: -0.143301 -0.266661 -0.187773 -0.207317 0.272777 0.399719 0.276842 -0.252912 0.516602 -0.148157 -0.185977 -0.079833 0.035493 -0.013057 0.010410 -0.210177 -0.241194 0.356077 0.044327 -0.137426 0.161538
polarizability: 3.43211213e+02 -1.12906039e+01 2.44275081e+02 -1.02815312e+01 1.67763011e+00 1.03918632e+02
1716.lowfreq: -7.1352 -5.7349 0.0004 0.0008 0.0008 0.6832 26.9260 31.1684 45.5033
frequency: 26.8759 31.1028 45.4974 60.7694 97.2121 107.8551 152.2081 181.6654 196.6650 197.3313 221.1118 246.5884 257.8431 296.0856 323.4421 346.7274 391.2724 403.4617 436.9822 445.5829 453.3499 457.1248 506.7520 525.7754 549.4659 551.0811 586.8959 614.1740 628.5415 642.7237 681.8843 685.5239 705.1677 719.4665 737.7229 774.8766 777.4748 820.2174 836.1150 857.1147 870.9728 894.2855 910.2915 919.0957 951.0975 958.9841 973.5699 980.9992 1009.2819 1020.1939 1045.0675 1076.3814 1095.4559 1111.8498 1126.1681 1151.8750 1168.5476 1183.4173 1193.5470 1212.5199 1240.9435 1253.8407 1283.4225 1295.1173 1307.9763 1336.6796 1386.2029 1397.2351 1430.8809 1435.4465 1451.8790 1467.4906 1468.0213 1475.6290 1482.8698 1528.3318 1537.4189 1567.7758 1577.8278 1591.0796 1611.3194 1616.4994 1625.4774 2962.7868 3052.6318 3124.6751 3128.9261 3130.4314 3142.5536 3151.0413 3154.2001 3170.3473 3171.9243 3176.5511 3183.3720 3539.7606
redmass: 5.1908 6.1778 5.1690 7.1069 3.7138 4.3361 6.3642 2.9735 2.5234 3.6874 3.5168 4.3270 1.9611 5.3930 4.8535 14.5017 3.8272 6.9826 4.9450 4.1449 3.4331 6.0576 3.5614 4.2957 2.2163 3.7215 3.8786 5.0984 6.1706 3.7334 3.2610 3.0344 5.8444 3.1635 4.4201 1.5839 1.6401 2.5317 3.0088 1.4875 1.7251 1.8869 4.4772 1.6390 6.0253 1.3319 1.4179 5.6615 1.3752 3.2868 2.4977 2.7981 1.6807 1.2581 1.8538 1.4515 1.4262 1.1050 1.5293 2.3107 2.7729 1.8842 1.6786 1.8415 3.1957 2.0356 9.6410 6.6584 1.4909 1.9846 2.3106 1.0837 1.2766 1.7909 2.6637 2.2367 7.3938 6.9346 7.7254 5.8643 4.6744 7.7901 6.4758 1.0330 1.1043 1.0869 1.0876 1.0994 1.0886 1.0934 1.0936 1.1005 1.0915 1.0956 1.0923 1.0747
irintensity: 0.8168 0.1401 1.1587 1.1550 6.5856 1.5673 1.8745 0.3069 0.3482 0.7719 3.8909 2.4089 0.6981 4.9471 1.7679 3.4602 1.1774 2.3266 2.6672 1.7480 27.4516 2.3197 4.0115 13.7089 50.9818 15.0049 6.6701 7.1863 3.9256 10.3817 14.8520 22.3165 7.6431 21.3544 17.9532 23.6254 100.8367 6.9913 7.9732 0.5777 36.3472 6.9130 5.8603 6.5012 16.8697 1.0711 3.4693 0.4429 0.9411 85.2192 3.5897 4.9708 14.7438 0.2176 28.1392 8.8496 110.0260 0.1818 48.5219 38.4327 46.9388 54.2853 62.0445 47.5597 13.8161 16.2240 5.6571 6.3226 21.5509 11.4228 56.1045 16.5065 34.4653 29.2002 111.8902 268.8292 382.7346 41.0620 198.9307 110.0865 92.5910 3.4168 124.7780 72.1561 44.2893 11.0411 5.9974 19.7427 8.7904 16.3960 5.0023 25.5553 2.4965 11.7739 0.8439 25.5440
temp: 298.150 k
press: 1.00000 atm
elementType: 8 8 8 7 6 6 6 6 6 6 6 6 6 6 6 6 6 6 6 6 6 1 1 1 1 1 1 1 1 1 1 1 1 1
symmnumber: 1
zpe: 675231.5 jmol-1
zpe.correction: 0.257182 hartree
zpe.thermalcorrener: 0.274780 hartree
zpe.thermalcorrenthalpy: 0.275724 hartree
zpe.thermalcorrgfe: 0.210297 hartree
zpe.sumelectzpe: -934.555398 hartree
zpe.sumelectthermal: -934.537800 hartree
zpe.sumelectthermalent: -934.536856 hartree
zpe.sumelectthermalfe: -934.602283 hartree
dipole: 4.7499 -8.9347 0.8702
dipole: 10.1562
quadrupole: -91.2498 -132.1626 -123.8388
quadrupole: 22.3942 -4.4499 5.9867
quadrupole: 24.5006 -16.4122 -8.0884 22.3942 -4.4499 5.9867
hfenergy: -934.81258 hartree
pointgroup: C01 [X(C17H13N1O3)]
dipole: -1.9478201 -3.485154 -0.1600885 debye
polarizability: 343.9869165|8.4847703|243.0867026|-6.7359721|-9.9358807|104.3313071 unknown
InChI: InChI=1S/C17H13NO3/c1-21-12-6-4-5-11(9-12)18-15-10-16(19)17(20)14-8-3-2-7-13(14)15/h2-10,18H,1H3
charge 0 multiplicity 1
34 atoms
O  3.937194 2.3947 0.094649
O  -4.362306 1.299034 -1.225263
O  1.323398 3.414537 0.458002
N  -0.426538 -1.09625 0.298679
C  1.967571 -0.73685 -0.06084
C  0.610476 -0.170533 0.190013
C  3.099252 0.136047 -0.065688
C  0.422634 1.200344 0.328448
C  -1.835511 -0.884669 0.310268
C  2.18449 -2.117835 -0.312828
C  2.942791 1.617846 0.107271
C  4.400233 -0.381352 -0.273571
C  1.508234 2.164353 0.298072
C  3.48625 -2.625797 -0.515964
C  4.602784 -1.758931 -0.487702
C  -2.45389 0.135036 -0.446566
C  -2.632455 -1.798617 1.057467
C  -3.864442 0.255267 -0.437487
C  -4.032978 -1.669041 1.04497
C  -4.668834 -0.642528 0.30946
C  -5.815426 1.486017 -1.274313
H  -0.147871 -2.057972 0.499509
H  -0.566724 1.613071 0.539866
H  1.346717 -2.819481 -0.395213
H  5.234973 0.327464 -0.270224
H  3.62555 -3.69508 -0.707506
H  5.611771 -2.153083 -0.645379
H  -1.879937 0.822305 -1.072011
H  -2.15419 -2.584518 1.653437
H  -4.643487 -2.369314 1.625219
H  -5.758353 -0.555646 0.324016
H  -5.968407 2.344746 -1.943608
H  -6.32221 0.593197 -1.689276
H  -6.224458 1.716936 -0.271805
