program: Gaussian 09
title: 000272557
version: EM64L-G09RevD.01
frameworkgroup: C1[X(C17H13NO2)]
method: RPBEPBE
basis: SDD
operation: Freq
keyword: #p
keyword: freq=noraman
keyword: PBEPBE/SDD
title: #p freq=noraman PBEPBE/SDD
converged: YES YES NO NO
title: Mulliken charges:
elementType: O O N C C C C C C C C C C C C C C C C C H H H H H H H H H H H H H
charge: -0.143196 -0.190154 -0.515278 0.275416 0.396262 0.276685 0.487490 -0.548050 -0.359815 -0.186557 -0.372995 0.037295 -0.511197 0.471670 -0.250028 -0.457520 -0.233540 -0.445892 -0.184821 -0.810075 0.307085 0.286800 0.211399 0.293171 0.279191 0.237375 0.234189 0.244376 0.239057 0.230090 0.224997 0.241204 0.235369
chargesum: 0.00000
title: Mulliken charges with hydrogens summed into heavy atoms:
elementType: O O N C C C C C C C C C C C C C C C C C
charge: -0.143196 -0.190154 -0.208193 0.275416 0.396262 0.276685 0.487490 -0.261251 -0.148416 -0.186557 -0.079824 0.037295 -0.232006 0.471670 -0.012653 -0.223331 0.010836 -0.206834 0.045269 -0.108506
polarizability: 3.33361766e+02 -1.28493356e+01 2.37963501e+02 -7.57196747e+00 4.03827700e+00 1.00562637e+02
1716.lowfreq: -9.8639 -2.7643 0.0005 0.0006 0.0008 6.0132 11.4413 33.7307 35.8474
frequency: -5.3787 33.7261 35.8023 50.9994 69.0055 110.7941 158.9517 184.0759 196.8664 214.1671 233.7850 277.2237 308.1905 346.4610 373.0889 393.5459 409.9130 437.4779 450.3423 456.4405 503.8731 514.5131 529.9173 546.7239 571.3257 597.9501 631.0755 641.9891 684.2165 692.7228 706.3363 719.4407 747.1067 777.0114 789.4266 821.0464 836.8020 870.9557 889.0917 899.8853 927.9761 931.1498 953.5307 973.6592 976.7510 987.7421 1009.6553 1013.6164 1045.4706 1050.6931 1078.3788 1100.8257 1128.4139 1177.2419 1183.0498 1185.3274 1212.8064 1245.7098 1254.5045 1291.8476 1299.3937 1310.6728 1336.6460 1385.7700 1387.2591 1400.6879 1432.8634 1440.3576 1463.5496 1470.9302 1480.3007 1486.4070 1530.4513 1537.7183 1567.7912 1577.4130 1597.1610 1611.7608 1616.4864 1621.1113 2982.1753 3061.7239 3090.6909 3120.3244 3122.0251 3135.9750 3142.8969 3151.4071 3154.7001 3160.3735 3170.9428 3173.7687 3536.8527
redmass: 1.0734 6.0459 3.8015 6.0205 5.8910 4.2481 5.3794 5.3730 4.4884 3.0818 6.0106 3.4920 6.5266 14.4373 3.7704 3.4418 5.8615 2.9981 4.1706 7.2191 3.0977 4.7866 2.6517 4.9951 2.1603 5.4757 6.2178 3.7468 5.9405 2.5996 4.6403 3.1111 3.9447 1.5820 1.6594 2.3610 3.1531 1.5531 1.4078 2.0313 1.4882 2.7161 4.3255 1.4090 1.3766 5.5333 1.3756 1.6609 2.4563 1.5678 2.9083 1.6204 1.8501 1.6749 1.0885 1.2274 2.2960 2.6048 1.8741 2.1189 1.5522 3.0900 1.8717 6.4546 6.6576 1.2859 2.5173 2.8652 1.8086 1.0453 1.6348 1.9102 2.4053 5.8847 6.8851 7.7579 6.0458 4.8808 7.3218 6.4288 1.0374 1.0977 1.0990 1.0881 1.0875 1.0906 1.0885 1.0922 1.0934 1.0991 1.1006 1.0909 1.0747
irintensity: 0.9538 0.0874 0.5430 0.1502 1.2808 2.1494 0.8057 1.3094 0.3051 1.7646 2.7295 3.4232 4.5185 3.6087 0.3804 0.8114 3.7607 5.8547 20.8353 0.2174 8.0077 6.8664 32.2725 6.1997 29.7374 8.9483 5.1224 11.1516 4.4591 20.7232 13.4216 22.3294 16.2090 49.7423 64.4798 3.3891 6.9711 15.7801 2.5749 9.8916 3.9078 2.7108 30.0346 2.8902 0.5027 0.6448 1.1008 2.5705 3.8750 11.2682 10.4744 13.3954 5.1257 3.1952 2.0402 2.2123 43.2041 11.9697 45.4924 51.7422 12.4083 10.6193 3.4007 12.0837 3.0294 17.9844 47.0275 60.1036 14.2743 15.2607 5.5011 80.9471 139.0986 410.1797 36.8776 204.0661 78.6916 67.0295 3.6368 52.8075 25.6435 15.5039 19.8762 6.2529 10.4805 14.6864 7.9591 9.0923 4.3659 23.3527 25.0237 1.7292 25.6988
temp: 298.150 k
press: 1.00000 atm
elementType: 8 8 7 6 6 6 6 6 6 6 6 6 6 6 6 6 6 6 6 6 1 1 1 1 1 1 1 1 1 1 1 1 1
symmnumber: 1
zpe: 663922.7 jmol-1
zpe.correction: 0.252875 hartree
zpe.thermalcorrener: 0.268751 hartree
zpe.thermalcorrenthalpy: 0.269695 hartree
zpe.thermalcorrgfe: 0.208403 hartree
zpe.sumelectzpe: -859.433658 hartree
zpe.sumelectthermal: -859.417782 hartree
zpe.sumelectthermalent: -859.416838 hartree
zpe.sumelectthermalfe: -859.478129 hartree
dipole: 3.6819 -8.3729 1.1379
dipole: 9.2171
quadrupole: -102.6355 -125.0840 -117.3132
quadrupole: 20.5655 -2.9868 6.7671
quadrupole: 12.3754 -10.0731 -2.3023 20.5655 -2.9868 6.7671
hfenergy: -859.6865329 hartree
pointgroup: C01 [X(C17H13N1O2)]
dipole: -1.5277146 -3.2848864 -0.1603186 debye
polarizability: 334.1925089|9.9821549|235.3614194|-4.1676109|-16.7501699|102.3339754 unknown
InChI: InChI=1S/C17H13NO2/c1-11-5-4-6-12(9-11)18-15-10-16(19)17(20)14-8-3-2-7-13(14)15/h2-10,18H,1H3
charge 0 multiplicity 1
33 atoms
O  3.804045 2.23343 0.008654
O  1.244727 3.424658 0.197115
N  -0.76746 -0.975613 0.27682
C  1.658331 -0.784974 -0.003658
C  0.329828 -0.125385 0.154344
C  2.838965 0.020365 -0.026353
C  -2.159855 -0.675357 0.205101
C  0.221683 1.260829 0.198377
C  1.802063 -2.190642 -0.148499
C  2.765226 1.517289 0.037575
C  4.113439 -0.582914 -0.148038
C  1.361282 2.157336 0.136417
C  -2.681176 0.328522 -0.649311
C  -4.077028 0.555595 -0.733126
C  3.077874 -2.784347 -0.265129
C  -3.047941 -1.479986 0.969024
C  4.241638 -1.981662 -0.256455
C  -4.951573 -0.24846 0.041152
C  -4.436468 -1.264186 0.87917
C  -4.61574 1.637938 -1.652662
H  -0.559795 -1.937504 0.550343
H  -0.747347 1.741739 0.351687
H  0.927943 -2.848796 -0.210315
H  4.988132 0.075726 -0.162925
H  -2.005675 0.918952 -1.276185
H  3.160577 -3.871009 -0.37346
H  -2.64955 -2.253828 1.636744
H  5.230437 -2.44228 -0.347665
H  -6.033009 -0.081829 -0.015564
H  -5.119275 -1.88262 1.471694
H  -5.717818 1.676416 -1.628197
H  -4.235766 2.635292 -1.363221
H  -4.306415 1.465002 -2.700255
