program: Gaussian 09
title: 000272656
version: EM64L-G09RevD.01
frameworkgroup: C1[X(C30H22O8)]
method: RPBEPBE
basis: SDD
operation: Freq
keyword: #pfreq=noraman
keyword: PBEPBE/SDD
title: #p freq=noraman PBEPBE/SDD
converged: YES YES NO NO
title: Mulliken charges:
elementType: O O O O O O O O C C C C C C C C C C C C C C C C C C C C C C C C C C C C C C H H H H H H H H H H H H H H H H H H H H H H
charge: -0.389933 -0.414192 -0.155037 -0.136356 -0.286760 -0.276660 -0.136454 -0.129392 -0.408937 0.206534 0.231587 0.350436 0.017632 0.045374 -0.173500 -0.159205 0.348055 0.444425 -0.495565 0.296267 0.248708 -0.397993 -0.227829 -0.223880 0.183991 -0.361533 0.230103 -0.388169 -0.380901 -0.376921 -0.370648 -0.225837 -0.257242 -0.237310 -0.234926 -0.239957 -0.521251 -0.686914 0.312086 0.273752 0.255589 0.245820 0.291756 0.196001 0.291990 0.296366 0.388383 0.363765 0.237345 0.241439 0.240534 0.247695 0.211787 0.211836 0.217628 0.256191 0.232921 0.212225 0.229091 0.235993
chargesum: 0.00000
title: Mulliken charges with hydrogens summed into heavy atoms:
elementType: O O O O O O O O C C C C C C C C C C C C C C C C C C C C C C C C C C C C C C
charge: -0.001550 -0.050427 -0.155037 -0.136356 -0.286760 -0.276660 -0.136454 -0.129392 -0.096850 0.206534 0.231587 0.350436 0.017632 0.045374 -0.173500 -0.159205 0.348055 0.444425 -0.221813 0.296267 0.248708 -0.142404 -0.227829 -0.223880 0.183991 -0.115712 0.230103 -0.096413 -0.184900 -0.084931 -0.074282 0.011508 -0.015804 0.003224 0.012769 0.183666 0.185489 -0.009606
polarizability: 4.12416543e+02 -2.45360072e+01 3.99994488e+02 -2.66267624e+00 -1.89008340e+01 3.37959357e+02
1716.lowfreq: -5.8627 -5.1217 -3.7184 -0.0003 0.0006 0.0008 15.8304 20.5717 22.8618
frequency: 15.7977 20.5469 22.8182 25.4421 27.1489 37.0535 56.2751 58.7532 62.7264 75.7149 82.9978 98.1524 110.5909 112.9705 120.9984 131.6696 139.9508 148.2227 157.1049 164.2018 184.3352 185.7973 190.0289 210.5221 245.9620 261.8035 274.7775 280.9016 285.2933 295.0384 308.2190 324.6234 352.7001 355.0690 359.3880 364.4526 366.5404 373.8307 394.4547 406.5808 409.7324 415.5677 439.5447 448.8152 456.3329 464.1475 467.8811 482.3081 507.0473 508.9597 541.4346 563.3815 573.4839 585.8523 612.1141 616.9673 626.6288 640.0705 652.4567 659.6684 673.6456 679.7297 706.0633 716.7661 722.3734 732.5084 733.8007 743.4393 756.6865 771.1655 790.7737 800.6662 833.3986 839.5979 845.4374 849.7713 865.9137 881.6461 891.9266 900.5359 907.9926 925.6236 926.6969 933.6300 945.1544 972.0166 973.9928 989.8691 1000.5418 1009.3460 1009.4343 1010.5824 1033.9714 1040.2334 1042.4895 1080.2866 1087.0129 1107.2150 1111.2458 1117.8416 1124.0429 1136.4592 1154.1616 1155.4679 1166.8443 1174.4731 1180.3470 1200.7145 1209.1616 1214.1303 1217.0263 1219.6066 1250.7478 1253.8991 1260.1241 1263.1260 1276.2309 1280.8806 1283.2404 1299.8413 1305.8890 1352.1047 1364.8772 1387.0289 1390.6738 1394.3093 1397.7481 1401.0463 1404.6416 1435.1657 1437.1028 1437.9310 1456.5550 1462.1118 1475.5969 1479.8286 1481.3625 1483.0079 1486.1070 1497.8495 1522.7647 1542.6666 1567.3041 1570.8421 1572.7057 1578.8721 1584.6819 1601.9077 1608.9195 1615.1075 1616.1743 1632.1057 2958.9392 2970.9145 2980.5318 2997.5775 3018.8653 3089.3773 3094.7149 3097.4335 3106.5811 3130.4155 3136.7926 3144.9244 3147.2359 3151.4431 3151.5226 3156.2146 3166.1128 3167.5050 3173.1890 3182.7665 3326.4169 3575.3937
redmass: 4.8287 6.2686 6.2794 5.9626 7.6246 5.5435 10.9985 2.9518 7.3296 3.6420 6.2089 5.5832 3.9762 2.0135 3.1661 4.9747 1.8435 2.8213 5.6689 8.0790 6.3721 6.0310 5.4801 3.2127 1.2126 1.9541 5.6300 2.9432 4.0188 4.5129 5.4431 5.4485 6.7945 6.1975 5.6818 10.5244 7.0707 6.1691 8.6423 7.3683 4.4962 5.2087 4.2979 4.0329 6.2716 3.6312 8.2924 6.0370 6.5515 6.2785 5.4982 6.4355 5.2131 4.9995 1.3892 3.7442 5.4358 6.3377 5.9269 5.7455 5.6569 5.8199 4.6630 4.4313 4.4461 4.0682 3.7096 5.0613 4.9045 1.5329 1.5035 1.4656 1.1220 6.5568 2.5197 6.0904 3.3181 2.8851 2.2088 2.9116 2.2543 2.1093 1.4487 3.6690 5.8486 1.4079 7.7534 1.3999 4.1522 1.3852 1.3971 4.3732 2.7826 2.0591 2.2465 3.1411 2.7048 2.3899 1.2673 2.1876 2.0552 1.4291 2.0426 1.5230 1.8217 1.1190 1.1428 1.8365 1.9199 2.3157 1.9759 2.3359 2.3099 3.1469 2.5229 1.1497 1.7655 2.0859 1.8898 2.2950 2.5550 2.4524 1.4021 2.5442 9.2434 7.6567 2.5506 1.3503 2.3633 1.3879 2.3178 2.4464 1.0686 1.0400 1.1787 1.0702 2.5724 2.8234 1.3007 1.6407 12.4132 12.8701 7.2514 8.4753 8.0338 7.8656 6.9841 7.7108 6.5393 7.9913 8.1493 7.4080 1.0554 1.0803 1.0337 1.0363 1.1077 1.0986 1.0989 1.0890 1.1015 1.1046 1.0864 1.0878 1.0868 1.0917 1.0912 1.0931 1.0976 1.0953 1.1004 1.0961 1.0660 1.0656
irintensity: 0.1089 1.2906 0.4606 1.1898 3.2947 1.1507 1.1152 3.6262 1.0105 2.0998 1.8943 1.3643 2.9696 3.4644 2.1309 0.7051 2.2753 1.5776 3.0775 3.2264 0.7300 0.0611 2.5619 6.5315 1.0314 44.4166 1.3665 21.1199 9.1286 20.7438 5.2106 5.6959 7.0929 0.4071 1.7729 2.4403 5.7137 5.1368 0.0421 5.1559 0.2831 0.2621 16.8140 23.7823 3.9500 13.8745 0.0956 2.3755 3.5446 3.6272 6.2768 7.3635 0.8275 10.0409 63.5487 25.8549 3.7173 7.0989 11.0477 16.3150 19.4772 7.7722 20.2357 32.9663 31.2130 3.5689 7.8147 4.6680 2.4709 68.7458 50.1394 31.7567 0.9132 5.2992 3.0309 24.5002 4.2023 10.3389 2.0919 42.3510 17.3021 1.2592 6.5713 9.0702 7.5837 3.1609 66.0333 4.1720 46.5855 0.1613 0.7294 1.8834 66.1526 0.3658 8.9309 17.2736 18.5655 51.2458 9.1261 31.1729 36.3225 4.2316 9.0422 21.1440 17.1896 3.8579 11.2055 75.8131 54.4829 10.8556 50.8031 90.9552 263.1017 121.4033 39.4776 0.2760 17.6419 15.1749 66.1220 44.7573 53.8887 54.4592 21.8682 11.1402 3.4691 19.3422 92.4988 26.2835 8.1212 4.5648 10.3887 13.6809 19.3969 12.3990 98.9343 9.9676 29.3355 37.2785 112.2029 92.6180 216.6133 279.9023 13.6807 6.7501 4.1116 128.2363 38.0645 28.8258 17.3885 24.2710 10.3804 17.8033 35.7754 20.3991 84.8362 25.3268 29.0356 33.7693 27.0798 20.1870 31.0837 15.7924 3.9036 4.1091 9.3020 2.1092 7.3529 3.0967 23.0340 11.3549 22.3704 7.6033 735.7808 31.8311
temp: 298.150 k
press: 1.00000 atm
elementType: 8 8 8 8 8 8 8 8 6 6 6 6 6 6 6 6 6 6 6 6 6 6 6 6 6 6 6 6 6 6 6 6 6 6 6 6 6 6 1 1 1 1 1 1 1 1 1 1 1 1 1 1 1 1 1 1 1 1 1 1
symmnumber: 1
zpe: 1167036.4 jmol-1
zpe.correction: 0.444501 hartree
zpe.thermalcorrener: 0.478337 hartree
zpe.thermalcorrenthalpy: 0.479281 hartree
zpe.thermalcorrgfe: 0.376086 hartree
zpe.sumelectzpe: -1755.482466 hartree
zpe.sumelectthermal: -1755.448630 hartree
zpe.sumelectthermalent: -1755.447686 hartree
zpe.sumelectthermalfe: -1755.550881 hartree
dipole: -3.2010 -1.8742 -12.4183
dipole: 12.9605
quadrupole: -186.2197 -201.6567 -222.7217
quadrupole: 1.2991 -28.0841 10.2613
quadrupole: 17.3130 1.8760 -19.1890 1.2991 -28.0841 10.2613
hfenergy: -1755.926967 hartree
pointgroup: C01 [X(C30H22O8)]
dipole: 0.5431569 -1.1496151 4.9379692 debye
polarizability: 429.0673282|8.2775278|383.1645962|10.5604653|17.6158196|338.1384646 unknown
InChI: InChI=1S/C30H22O8/c1-3-38-20-13-12-15(14-21(20)37-2)22(23-25(31)16-8-4-6-10-18(16)27(33)29(23)35)24-26(32)17-9-5-7-11-19(17)28(34)30(24)36/h4-14,22,31-32H,3H2,1-2H3
charge 0 multiplicity 1
60 atoms
O  1.548543 1.194207 1.538353
O  -1.336496 0.394159 1.689438
O  -1.173253 1.988709 -2.374692
O  -1.508666 -1.598486 -2.62957
O  4.655835 -1.594244 -1.197602
O  4.303427 -3.542449 0.849637
O  -0.724791 4.735722 -2.07306
O  -4.232706 -2.175935 -2.305187
C  0.008474 -0.017234 -0.815083
C  0.237456 1.470689 -0.506966
C  -1.418477 -0.470182 -0.50985
C  1.105161 -0.968147 -0.300004
C  0.974068 1.977384 0.560503
C  -2.081579 -0.21333 0.675128
C  -0.418673 2.398273 -1.435405
C  -2.1031 -1.228297 -1.575074
C  1.212716 3.420532 0.773843
C  -3.496546 -0.564028 0.931031
C  2.37802 -0.924723 -0.928978
C  0.643201 4.377007 -0.116812
C  -4.248568 -1.215572 -0.093047
C  0.899988 -1.925924 0.721193
C  -0.198582 3.925537 -1.261164
C  -3.601263 -1.586707 -1.387412
C  3.424579 -1.786975 -0.555608
C  1.940482 -2.802156 1.113082
C  3.209954 -2.739832 0.494894
C  2.007894 3.869335 1.856852
C  -4.141077 -0.269768 2.16015
C  0.873533 5.758766 0.083363
C  -5.609362 -1.53649 0.114254
C  2.233539 5.250396 2.047933
C  -5.502571 -0.588913 2.358492
C  1.667336 6.199337 1.162666
C  -6.243585 -1.221183 1.333723
C  4.122198 -4.504776 1.957723
C  5.330428 -2.770732 -1.788979
C  5.458663 -5.216043 2.149473
H  0.054572 -0.084766 -1.92223
H  2.576057 -0.214661 -1.739155
H  -0.077436 -2.009515 1.205435
H  1.747785 -3.527857 1.908294
H  2.444698 3.130636 2.533177
H  -3.607896 0.207765 2.992926
H  0.420883 6.464097 -0.621203
H  -6.146374 -2.035877 -0.698823
H  1.387715 0.221961 1.357309
H  -1.895399 0.725505 2.434946
H  2.853276 5.58701 2.886064
H  -5.981444 -0.346579 3.312789
H  1.846482 7.268851 1.314189
H  -7.29869 -1.467055 1.488719
H  3.823831 -3.953417 2.872729
H  3.317158 -5.220721 1.694006
H  4.66597 -3.262941 -2.524656
H  5.632042 -3.488215 -1.009473
H  6.212099 -2.356792 -2.301005
H  5.38512 -5.938531 2.982461
H  5.745977 -5.766243 1.237171
H  6.255276 -4.490284 2.385391
