program: Gaussian 09
title: 000272539
version: EM64L-G09RevD.01
frameworkgroup: C1[X(C10H10Cl2N2O2)]
method: RPBEPBE
basis: SDD
operation: Freq
keyword: #p
keyword: freq=noraman
keyword: PBEPBE/SDD
title: #p freq=noraman PBEPBE/SDD
converged: YES YES NO NO
title: Mulliken charges:
elementType: Cl Cl O O N N C C C C C C C C C C H H H H H H H H H H
charge: -0.029501 -0.029692 -0.398157 -0.280343 -0.342546 -0.119336 0.144736 0.638277 -0.517480 -0.713703 0.201576 -0.316727 -0.390439 -0.212397 -0.231649 -0.108794 0.301259 0.252138 0.254329 0.231624 0.240410 0.236303 0.263226 0.378565 0.286189 0.262132
chargesum: 0.00000
title: Mulliken charges with hydrogens summed into heavy atoms:
elementType: Cl Cl O O N N C C C C C C C C C C
charge: -0.029501 -0.029692 -0.019591 -0.280343 -0.041287 -0.119336 0.144736 0.638277 -0.011013 -0.005365 0.201576 -0.316727 -0.127213 0.073793 0.030482 -0.108794
polarizability: 2.08922958e+02 1.42504674e+01 1.35828900e+02 6.70632635e+00 6.20104883e-01 9.44862100e+01
1716.lowfreq: -5.3224 -0.0008 0.0015 0.0016 2.2372 6.3146 38.2465 53.5041 59.3130
frequency: 38.1772 53.4805 59.2942 108.0451 153.0370 163.7925 176.5258 197.8176 211.3632 233.2451 255.9038 294.0986 315.3407 340.8117 371.9740 376.1953 398.6437 433.1314 445.1019 474.8660 502.6268 542.6900 567.3074 569.3675 589.3554 648.7553 659.6619 668.4251 723.5117 747.0961 820.9271 845.6769 869.2199 882.2007 959.2522 985.3888 1002.9324 1012.1802 1039.9215 1058.3636 1089.4879 1095.5131 1106.7393 1128.1549 1168.3919 1189.8222 1234.9298 1267.7350 1301.0462 1323.4884 1350.1318 1373.5808 1384.1173 1430.1798 1432.4565 1458.1664 1464.6252 1474.3677 1475.4584 1564.2753 1591.9856 1619.2895 3001.4281 3002.7587 3062.5306 3103.1576 3113.4756 3168.6446 3183.5127 3189.1728 3293.0104 3486.7270
redmass: 11.3465 7.8813 4.9905 4.0511 4.7648 6.4861 7.9293 7.2218 4.8289 7.0609 6.4736 1.4670 2.0520 6.1718 3.2875 4.7367 1.4097 3.5584 3.3547 6.3421 5.3116 3.4854 4.1845 5.6840 2.8496 6.2482 4.6468 2.8967 3.3442 5.9487 1.4032 2.9267 1.4083 2.1527 1.3631 2.3065 2.7057 3.8342 3.8286 4.4570 3.4601 1.9968 2.2403 2.1430 1.7486 1.4174 2.2919 1.3651 1.8559 2.7103 4.6658 4.0778 1.2642 1.6036 1.2220 2.3318 1.0907 1.0993 1.0529 7.9901 7.0846 10.4979 1.0519 1.0443 1.1025 1.1000 1.1015 1.0891 1.0934 1.0955 1.0647 1.0761
irintensity: 0.1391 0.7006 0.7106 2.2983 1.3630 0.0069 1.5474 0.9640 6.4621 5.0405 23.5929 0.3521 1.6682 2.0518 11.9704 16.4485 87.3565 8.9871 3.5847 24.1852 0.1350 20.9911 4.8118 13.5168 40.2522 9.7765 25.4451 81.4301 13.7360 77.1729 30.7360 11.5518 19.7540 2.7929 0.1263 20.0594 9.9950 34.1435 38.5446 21.6475 1.7685 32.4347 22.8850 43.7617 22.3779 3.4823 39.8588 4.9075 101.5980 52.5067 14.7467 5.9669 31.7440 95.9063 83.7478 43.5612 11.7302 12.8090 3.8235 28.9828 87.2967 304.2430 33.8891 16.4436 8.7131 24.7884 12.7625 0.5599 0.4024 2.6787 26.7106 5.8402
temp: 298.150 k
press: 1.00000 atm
elementType: 17 17 8 8 7 7 6 6 6 6 6 6 6 6 6 6 1 1 1 1 1 1 1 1 1 1
symmnumber: 1
zpe: 490014.7 jmol-1
zpe.correction: 0.186637 hartree
zpe.thermalcorrener: 0.201870 hartree
zpe.thermalcorrenthalpy: 0.202814 hartree
zpe.thermalcorrgfe: 0.143707 hartree
zpe.sumelectzpe: -1565.899033 hartree
zpe.sumelectthermal: -1565.883800 hartree
zpe.sumelectthermalent: -1565.882855 hartree
zpe.sumelectthermalfe: -1565.941963 hartree
dipole: 1.5999 1.8462 -2.1374
dipole: 3.2460
quadrupole: -121.1383 -99.7603 -109.5526
quadrupole: -2.0031 5.6001 2.7656
quadrupole: -10.9879 10.3901 0.5978 -2.0031 5.6001 2.7656
hfenergy: -1566.0856698 hartree
pointgroup: C01 [X(C10H10Cl2N2O2)]
dipole: -0.6414636 -0.8097027 -0.7508806 debye
dipolederiv: -0.3706241 -0.2561722 0.0503796 -0.3086805 -0.4781483 0.052237 0.0913213 0.0548861 -0.0662493 -0.8830494 0.1057512 0.0590924 0.1630765 -0.1401075 -0.0068638 0.0621222 -0.0039059 -0.0567074 -0.1961797 0.0747932 -0.052079 -0.0690063 -0.3169839 0.0089002 0.1701187 0.0449953 -0.5911139 -1.1040244 -0.2616079 -0.1272574 -0.3209746 -0.4462207 -0.0461975 -0.5256112 -0.1933957 -0.6355064 -0.5463509 -0.027991 0.118269 -0.1265556 -0.3918041 -0.1302634 -0.0708127 -0.0200458 -0.6362415 -1.2556205 -0.2804182 0.0347529 -0.0484002 -0.2659925 -0.1237379 0.0061794 -0.0887549 0.1363902 1.0572629 -0.0751249 0.0852693 -0.0380647 0.7207274 0.0577519 0.2808843 0.0794195 0.6165599 -0.1137219 -0.1051384 0.0229115 0.0640226 -0.3302257 0.0243603 0.0678263 0.0131496 -0.0803395 0.4496416 0.00792 -0.0911842 -0.0003028 0.2185699 0.0099512 0.0138874 -0.0035899 -0.1341232 -0.1248813 0.0987725 -0.0186764 0.0133527 -0.2145251 0.019192 -0.0517262 -0.0157964 0.0112438 1.6031015 0.5117379 0.1705129 0.5860253 0.2937917 0.0738514 0.1089739 0.1008359 0.5582212 0.5311202 0.4662004 -0.0815467 0.3073025 0.7275146 -0.0961701 -0.0768568 -0.0962125 -0.0351362 0.0733747 0.0158015 -0.0219638 0.052356 0.0355808 -0.012296 -0.0282182 -0.0186045 -0.1013747 -0.5300923 -0.1116665 0.0520483 -0.0760566 -0.1659137 0.0183688 0.054886 0.0254895 -0.0675008 -0.3585417 0.1455211 0.0076359 0.1731872 -0.0759616 -0.0164447 0.0088947 -0.0146399 -0.0965296 1.3233581 -0.1882126 -0.1056519 -0.2183638 0.2556695 -0.0019416 -0.1100216 -0.00351 -0.051809 0.1065966 0.0016465 -0.0212472 0.019828 0.0928036 0.1290875 -0.0783899 0.0569786 0.2842313 0.0651972 -0.0058884 -0.0247029 -0.0778865 -0.053468 0.0945395 0.0094278 0.0541834 0.0543151 -0.1373143 0.03519 0.035582 0.0986279 0.03905 -0.0545709 0.0169074 -0.0214979 0.0627373 0.0551306 -0.0810321 -0.0816006 -0.0923136 0.0203785 -0.0578424 -0.0966416 -0.0516207 -0.0010856 -0.1410147 0.0592298 0.0137817 0.0057078 0.0885123 0.0090668 0.018596 -0.0024068 0.0944396 0.0901518 -0.0447888 0.0632159 -0.018262 0.0529844 0.0424903 0.0798636 0.0651213 -0.0526706 0.1094258 0.027819 0.0044944 0.0438418 -0.0328806 0.0079322 -0.0019829 0.0099549 0.1296076 0.1825157 -0.0711289 -0.1118008 -0.0994002 0.3003292 -0.0228795 0.0280917 0.0074192 0.3294793 0.0886546 0.0206195 0.0043291 0.0285496 0.0318156 0.0078948 0.0044697 0.0072969 0.1648206 0.0258839 -0.0618328 0.0154359 -0.0616106 0.0345041 0.0135839 0.0178107 0.0142505 0.1643417 unknown
polarizability: 209.8449931|11.2520468|134.307056|-6.9281861|-5.4282879|95.0860188 unknown
InChI: InChI=1S/C10H10Cl2N2O2/c1-10(13-5-9(15)14(10)16)7-3-2-6(11)4-8(7)12/h2-4,13,16H,5H2,1H3
charge 0 multiplicity 1
26 atoms
Cl -0.028978 2.371351 -0.473709
Cl -5.170874 0.539019 0.137804
O  1.533154 -0.31612 2.09835
O  3.815196 0.852792 1.023763
N  1.498986 -0.262239 -1.580312
N  1.678139 -0.008069 0.701317
C  0.882002 -0.773147 -0.309913
C  -0.615536 -0.417246 -0.212155
C  2.834659 0.345413 -1.28105
C  1.180407 -2.279902 -0.144981
C  2.89008 0.463647 0.24506
C  -1.117471 0.912132 -0.260895
C  -1.586541 -1.440828 -0.055653
C  -2.487905 1.217982 -0.153021
C  -2.967429 -1.177175 0.049305
C  -3.400257 0.158911 0.000312
H  0.877475 0.396511 -2.063206
H  2.944629 1.336724 -1.755032
H  3.669019 -0.293694 -1.624752
H  0.688135 -2.857831 -0.943973
H  2.267962 -2.430816 -0.250374
H  0.872152 -2.654158 0.846206
H  -1.25621 -2.480513 -0.00639
H  2.388065 0.061753 2.481538
H  -2.829051 2.255098 -0.189053
H  -3.684807 -1.992996 0.17041
