program: Gaussian 09
title: 000272533
version: EM64L-G09RevD.01
frameworkgroup: C1[X(C10H18N2O3)]
method: RPBEPBE
basis: SDD
operation: Freq
keyword: #p
keyword: freq=noraman
keyword: PBEPBE/SDD
title: #p freq=noraman PBEPBE/SDD
converged: NO YES NO NO
title: Mulliken charges:
elementType: O O O N N C C C C C C C C C C H H H H H H H H H H H H H H H H H H
charge: -0.282694 -0.400714 -0.287878 -0.324947 -0.103617 0.047257 -0.455644 -0.454542 -0.182167 -0.448529 -0.468803 0.041440 -0.506903 0.196956 -0.515867 0.232544 0.225147 0.191722 0.220822 0.209523 0.254669 0.211992 0.201127 0.218821 0.212802 0.172272 0.290800 0.247217 0.249808 0.375334 0.194956 0.203466 0.233630
chargesum: 0.00000
title: Mulliken charges with hydrogens summed into heavy atoms:
elementType: O O O N N C C C C C C C C C C
charge: -0.282694 -0.025379 -0.287878 -0.034148 -0.103617 0.279802 -0.038774 -0.024197 0.072502 -0.035410 -0.037180 0.213712 -0.009878 0.196956 0.116186
polarizability: 1.50165581e+02 -8.31063239e+00 1.17181601e+02 -8.20565172e+00 -5.14043611e-01 1.15111428e+02
1716.lowfreq: -11.8592 -5.8510 -0.0006 0.0005 0.0006 7.9795 44.8844 52.8734 66.4603
frequency: 44.8664 52.8488 66.4453 83.8229 118.0241 158.0104 173.0673 181.4537 219.5407 223.8779 234.0208 251.6101 290.1982 318.1429 382.3107 406.5366 427.6938 455.0294 467.1125 492.7356 508.6033 554.6526 575.3556 607.3599 657.2284 721.7892 767.1811 796.4295 818.0982 856.2685 888.7669 896.5375 909.0265 961.7107 979.7950 1004.2117 1024.7625 1034.5154 1044.9479 1055.8203 1058.8640 1097.4237 1105.9382 1114.2126 1123.5247 1140.4079 1150.6591 1169.0121 1175.2169 1215.0140 1235.0636 1249.7739 1252.2280 1286.7766 1288.0336 1298.7240 1306.9322 1314.0349 1324.0625 1338.8442 1345.4643 1350.0897 1367.0007 1381.3213 1426.7925 1434.6344 1447.5033 1458.9641 1464.3471 1466.1268 1473.4623 1475.8870 1479.7758 1485.1336 1614.7037 2895.1105 2927.0824 2965.3542 2972.0051 2977.9041 2982.7588 2992.5236 2998.6345 3000.8766 3003.7442 3023.7900 3039.1605 3045.0437 3060.2124 3060.8310 3095.6638 3272.3001 3498.1624
redmass: 3.4684 4.8208 5.3728 2.2186 3.6006 3.1514 1.7910 2.5877 2.4346 1.9622 4.3502 4.1672 2.9712 4.0328 3.0613 2.7635 1.3059 3.0504 2.5339 4.1763 2.4898 3.3036 2.6846 2.9447 5.8600 3.3739 2.8580 1.4451 3.1587 2.4070 2.3654 3.1359 1.3442 2.4692 2.1602 2.0475 4.7006 2.3066 2.5777 2.2105 1.5835 3.7507 2.5143 1.3387 1.9601 2.3225 2.2767 1.4570 1.3193 1.3555 1.3830 1.4289 1.3708 1.3360 1.4401 1.4505 1.2903 1.2422 1.3897 1.5895 1.6789 1.6231 1.4952 1.4051 1.2079 1.1320 1.6670 1.0667 1.0845 1.0892 1.0850 1.0625 1.0794 1.0891 10.4068 1.0825 1.0351 1.0593 1.0728 1.0677 1.0618 1.0631 1.0854 1.0634 1.1007 1.1000 1.1000 1.1025 1.1023 1.1019 1.0972 1.0646 1.0768
irintensity: 0.3501 0.3052 0.2159 3.7857 2.5853 1.2598 1.7628 2.1898 6.1292 2.9073 17.5061 23.9123 2.3863 0.2321 6.1106 27.1666 92.6230 4.4252 0.1115 0.9763 5.4569 45.4708 41.9967 14.9702 14.9309 69.5316 1.4906 1.1804 0.2704 14.6258 3.3749 12.3134 11.9050 17.8321 1.7428 2.4163 17.8407 2.8187 14.4556 96.2304 49.5728 10.5971 2.3983 2.2575 14.1241 49.4324 19.5144 3.6462 3.7115 4.6311 0.7165 17.1696 8.3525 2.5186 35.2510 16.8335 7.9423 0.9333 1.4304 15.7599 28.8190 7.3982 9.1189 8.5496 6.9502 3.8651 71.8866 11.4569 3.3300 5.8268 21.3520 5.9867 15.5283 1.6088 270.3787 46.7772 82.4246 29.3366 9.1666 39.1278 22.2499 20.9610 57.0684 23.8348 71.1184 58.2863 20.5050 50.9013 17.3559 49.0311 35.8146 26.5637 5.0351
temp: 298.150 k
press: 1.00000 atm
elementType: 8 8 8 7 7 6 6 6 6 6 6 6 6 6 6 1 1 1 1 1 1 1 1 1 1 1 1 1 1 1 1 1 1
symmnumber: 1
zpe: 732339.0 jmol-1
zpe.correction: 0.278933 hartree
zpe.thermalcorrener: 0.294180 hartree
zpe.thermalcorrenthalpy: 0.295124 hartree
zpe.thermalcorrgfe: 0.236410 hartree
zpe.sumelectzpe: -725.772026 hartree
zpe.sumelectthermal: -725.756780 hartree
zpe.sumelectthermalent: -725.755835 hartree
zpe.sumelectthermalfe: -725.814549 hartree
dipole: -1.4034 4.3086 -0.6594
dipole: 4.5791
quadrupole: -98.5480 -89.2619 -90.9818
quadrupole: 4.2502 1.2548 -2.0471
quadrupole: -5.6175 3.6687 1.9488 4.2502 1.2548 -2.0471
hfenergy: -726.0509596 hartree
pointgroup: C01 [X(C10H18N2O3)]
dipole: 0.5540357 -1.7075755 0.1511967 debye
polarizability: 150.9007561|-6.0783508|117.3352162|8.5394559|0.1701488|114.222638 unknown
InChI: InChI=1S/C10H18N2O3/c1-15-8-4-2-7(3-5-8)10-11-6-9(13)12(10)14/h7-8,10-11,14H,2-6H2,1H3
charge 0 multiplicity 1
33 atoms
O  4.067205 0.78651 -0.433742
O  -2.421624 1.277487 1.688671
O  -3.8549 1.150757 -0.6764
N  -1.701418 -1.76762 -0.231313
N  -2.457912 0.100066 0.862537
C  0.055286 -0.221974 0.829124
C  1.147592 -1.306079 0.999367
C  0.272554 0.567338 -0.483834
C  -1.343365 -0.883257 0.917804
C  2.569521 -0.69776 0.932884
C  1.695176 1.171325 -0.547306
C  2.770995 0.086466 -0.383631
C  -2.656422 -1.060142 -1.14163
C  -3.102618 0.177117 -0.35577
C  5.216569 -0.102147 -0.589035
H  0.122977 0.488335 1.680374
H  1.019806 -2.061207 0.197365
H  1.016951 -1.834621 1.965539
H  -0.471702 1.381469 -0.576831
H  0.122769 -0.121062 -1.340199
H  -1.399953 -1.459662 1.86218
H  2.725684 0.001777 1.778309
H  3.322232 -1.503712 1.02831
H  1.8534 1.698023 -1.506018
H  1.830198 1.91833 0.259668
H  2.71028 -0.627849 -1.241009
H  -2.060963 -2.67426 0.083787
H  -3.519691 -1.695528 -1.407087
H  -2.175349 -0.730924 -2.081386
H  -3.050429 1.894687 1.191953
H  5.093499 -0.7746 -1.465841
H  5.398118 -0.72237 0.31296
H  6.086933 0.553384 -0.753201
