program: Gaussian 09
title: 000272529
version: EM64L-G09RevD.01
frameworkgroup: C1[X(C14H13NO3)]
method: RPBEPBE
basis: SDD
operation: Freq
keyword: #p
keyword: freq=noraman
keyword: PBEPBE/SDD
title: #p freq=noraman PBEPBE/SDD
converged: YES YES NO NO
title: Mulliken charges:
elementType: O O O N C C C C C C C C C C C C C C H H H H H H H H H H H H H
charge: -0.237378 -0.143038 -0.186543 -0.196120 -0.376782 -0.420351 0.398332 -0.322611 -0.303321 0.268341 0.258828 -0.512054 -0.361201 -0.180108 0.033226 -0.375540 -0.242870 -0.234772 0.229103 0.244096 0.259516 0.248393 0.197945 0.231325 0.227401 0.191593 0.267104 0.264802 0.291416 0.237406 0.243861
chargesum: 0.00000
title: Mulliken charges with hydrogens summed into heavy atoms:
elementType: O O O N C C C C C C C C C C C C C C
charge: -0.237378 -0.143038 -0.186543 -0.196120 0.096417 0.087558 0.398332 0.106660 0.115673 0.268341 0.258828 -0.244950 -0.096399 -0.180108 0.033226 -0.084124 -0.005464 0.009089
polarizability: 2.33189689e+02 -1.22909153e+01 2.10712390e+02 3.96779900e+00 -1.82234763e+00 8.84906637e+01
1716.lowfreq: -7.2949 -0.0006 0.0003 0.0005 4.6079 9.4931 42.8615 60.4749 72.9335
frequency: 42.8302 60.4190 72.8830 91.2587 140.0207 194.4639 199.6513 231.0589 250.1217 283.9708 292.4042 344.3629 350.2702 391.2317 407.5515 423.8971 447.1051 459.4692 469.8812 504.0078 517.9007 595.4708 628.4665 651.8081 667.6994 691.5164 730.5216 761.0856 782.1802 801.4394 818.1064 843.7385 862.7630 878.2237 906.9128 916.9477 947.5697 982.0065 1007.4758 1015.0445 1018.7455 1044.1344 1053.8575 1079.7293 1087.6398 1103.6606 1133.2090 1159.1279 1177.4484 1191.6891 1210.6018 1223.8925 1248.5955 1254.0285 1278.2580 1291.0026 1320.2097 1335.4948 1346.4895 1359.3734 1371.7746 1383.1113 1389.7698 1435.7702 1448.3128 1453.8060 1455.8481 1464.7519 1479.8744 1536.5461 1561.0060 1574.3203 1597.0381 1615.6823 2939.4288 2942.1522 2954.3568 2960.8086 3063.8628 3088.5097 3090.9053 3093.6803 3135.3698 3148.6028 3159.1795 3159.5424 3171.1926
redmass: 8.8677 5.9467 3.4205 5.0421 4.6578 4.7560 3.9451 5.6358 3.4442 4.1708 2.7199 14.4441 3.5112 5.1351 2.3656 5.3172 5.7291 3.0091 4.2648 4.5147 4.1347 3.6022 3.3050 3.3007 5.6912 6.1451 3.9045 3.9934 1.5744 3.7033 2.2466 1.7425 3.6407 2.0955 1.6754 2.0594 6.6478 1.3996 1.3972 2.5374 2.2382 2.1083 1.8625 4.6771 2.6815 2.2271 2.2987 3.3003 1.0800 1.0765 2.3396 1.5746 1.4240 1.8119 1.2100 2.1501 1.6391 1.3147 1.3158 1.4164 1.3585 6.0010 3.3122 2.3843 1.0830 1.0957 1.0937 1.1700 2.4160 11.4039 6.3715 8.8000 6.7949 8.0887 1.0685 1.0701 1.0681 1.0666 1.0945 1.0956 1.0975 1.0912 1.0859 1.0896 1.0940 1.0908 1.1005
irintensity: 0.6376 2.6513 1.4955 0.4620 1.3748 2.3450 3.7193 3.6776 15.0714 15.0677 2.5300 2.5041 6.6459 0.1838 3.8650 2.5137 3.0127 1.2542 4.3539 7.5590 4.2807 19.0383 1.9346 9.2256 7.1989 0.0956 15.6563 5.7796 67.5892 8.4291 4.7356 0.0179 33.8435 29.1294 3.1277 7.7854 25.0639 5.1415 2.9802 38.4513 9.4299 2.6114 18.1870 58.4184 24.6338 4.3195 13.9725 2.2023 0.6101 9.6428 33.0014 97.0858 51.4335 23.3951 5.8895 42.1020 9.4399 8.5963 4.4678 27.1333 1.8830 36.3905 58.6221 11.4661 7.3611 26.0630 6.2381 24.8989 1.7714 140.1308 229.8992 173.1640 69.8760 12.0720 39.4632 28.6175 43.2669 93.6566 16.8726 22.4644 37.9791 14.2611 1.9200 4.3431 5.5407 9.4110 22.5654
temp: 298.150 k
press: 1.00000 atm
elementType: 8 8 8 7 6 6 6 6 6 6 6 6 6 6 6 6 6 6 1 1 1 1 1 1 1 1 1 1 1 1 1
symmnumber: 1
zpe: 635552.8 jmol-1
zpe.correction: 0.242069 hartree
zpe.thermalcorrener: 0.256607 hartree
zpe.thermalcorrenthalpy: 0.257551 hartree
zpe.thermalcorrgfe: 0.200233 hartree
zpe.sumelectzpe: -820.384958 hartree
zpe.sumelectthermal: -820.370420 hartree
zpe.sumelectthermalent: -820.369476 hartree
zpe.sumelectthermalfe: -820.426794 hartree
dipole: -5.4723 5.9795 -0.6267
dipole: 8.1298
quadrupole: -125.1401 -106.2921 -103.1089
quadrupole: 20.7668 0.5519 1.4637
quadrupole: -13.6264 5.2216 8.4048 20.7668 0.5519 1.4637
hfenergy: -820.627027 hartree
pointgroup: C01 [X(C14H13N1O3)]
dipole: 2.2986281 -2.1232943 0.6620812 debye
polarizability: 234.6941736|-9.6934417|193.8158343|5.1158096|-40.4362336|103.8827351 unknown
InChI: InChI=1S/C14H13NO3/c16-13-9-12(15-5-7-18-8-6-15)10-3-1-2-4-11(10)14(13)17/h1-4,9H,5-8H2
charge 0 multiplicity 1
31 atoms
O  4.564382 0.31272 0.203355
O  -3.885635 0.883737 -0.179856
O  -2.266563 2.882843 -1.368123
N  1.689655 0.375228 -0.167055
C  2.568153 1.301625 -0.9226
C  2.299694 0.000787 1.144751
C  0.293488 0.484424 -0.294452
C  3.959884 0.660564 -1.091078
C  3.687997 -0.620301 0.928103
C  -0.54515 -0.692973 0.073856
C  -1.967472 -0.555397 0.125363
C  -0.302175 1.624118 -0.825638
C  0.013906 -1.980203 0.291865
C  -2.639601 0.717683 -0.289746
C  -1.741747 1.822303 -0.899917
C  -2.779288 -1.659442 0.482356
C  -0.803562 -3.077577 0.637939
C  -2.203748 -2.91572 0.758493
H  2.664802 2.276771 -0.396137
H  2.132308 1.484926 -1.91997
H  1.63886 -0.686473 1.694037
H  2.411408 0.922448 1.757004
H  3.874384 -0.249662 -1.722937
H  4.657557 1.371519 -1.562504
H  4.188954 -0.809217 1.891242
H  3.59903 -1.573331 0.361566
H  0.298368 2.485804 -1.131887
H  1.086893 -2.13465 0.145928
H  -3.863354 -1.507267 0.511115
H  -0.349388 -4.060984 0.800694
H  -2.836643 -3.765703 1.033234
