program: Gaussian 09
title: 000026201
version: EM64L-G09RevD.01
frameworkgroup: C1[X(C11H10ClN3)]
method: RPBEPBE
basis: SDD
operation: Freq
keyword: #p
keyword: freq=noraman
keyword: PBEPBE/SDD
title: #p freq=noraman PBEPBE/SDD
converged: YES YES NO NO
title: Mulliken charges:
elementType: Cl N N N C C C C C C C C C C C H H H H H H H H H H
charge: 0.006788 -0.050641 0.060659 0.040099 -0.449367 0.287816 0.060258 0.003556 -0.678976 -0.350205 -0.337082 -0.227825 -0.228159 -0.221284 -0.338702 0.234086 0.229730 0.229876 0.230510 0.236551 0.278085 0.282074 0.233283 0.234600 0.234271
chargesum: 0.00000
title: Mulliken charges with hydrogens summed into heavy atoms:
elementType: Cl N N N C C C C C C C C C C C
charge: 0.006788 -0.050641 0.060659 0.040099 0.014449 0.287816 0.060258 0.003556 0.017961 -0.072120 -0.055008 0.005458 0.006441 0.012987 -0.338702
polarizability: 2.34830179e+02 -5.09781270e+00 1.69734960e+02 -3.64209724e+00 -7.11238620e+00 6.92616531e+01
1716.lowfreq: -9.5676 -6.1180 -3.6497 0.0003 0.0018 0.0026 12.6811 43.2056 73.2167
frequency: 7.2810 43.1796 73.2069 105.4280 116.4758 149.0456 194.8115 215.2392 241.2855 278.4398 314.0420 331.1578 403.8153 412.0770 456.4789 520.5902 549.6796 614.1584 643.1006 655.9798 689.1140 706.5895 783.7529 785.5984 811.2549 840.9026 856.8924 867.9722 905.2276 963.1837 988.8362 990.9622 1003.0649 1013.5593 1019.5260 1046.0963 1057.6419 1077.6062 1111.3480 1160.1562 1174.0529 1182.4316 1204.3847 1269.4139 1294.1980 1313.4615 1334.2155 1380.5224 1385.3217 1397.1435 1419.9710 1446.0461 1455.7168 1469.9773 1476.2033 1487.9113 1492.7034 1586.3504 1611.8244 2990.4563 3025.5917 3082.4537 3094.1338 3107.1821 3131.4663 3144.8610 3158.1207 3170.2186 3176.5192
redmass: 2.5927 3.9046 5.8125 5.5214 5.1666 12.0607 1.6128 5.9949 1.9832 4.6458 3.5647 6.6222 2.8570 7.5750 3.6908 4.8918 5.6275 6.4633 7.5598 7.6996 4.1104 1.7582 1.8330 2.2135 2.6713 5.9317 4.1862 1.2437 12.3061 1.4299 4.6143 3.6005 1.3779 1.3345 2.4850 1.8562 1.9124 1.6214 3.0064 6.7677 1.0576 1.1477 2.9084 1.5422 1.6932 1.3846 2.9248 1.5879 3.6461 5.1197 3.1792 2.6388 1.3293 2.4168 1.1439 1.4568 2.2226 6.3063 6.1244 1.0342 1.0591 1.1018 1.1003 1.1041 1.0857 1.0895 1.0941 1.0952 1.0996
irintensity: 0.1708 0.1207 0.7227 0.3678 0.1548 0.0296 0.1921 0.1714 0.0646 0.8096 6.8097 0.2482 0.0031 7.0481 3.9968 0.7845 13.3544 0.3332 25.0769 2.7502 3.1067 72.7087 17.5390 36.9239 69.4600 0.4048 37.5159 0.0106 3.8077 4.3541 6.2407 2.6911 0.0069 0.5480 7.4054 4.2190 45.3512 5.8808 32.0556 26.8984 0.2606 35.3567 106.8922 133.3908 6.5588 12.4430 66.7944 27.4601 101.0293 10.6998 256.8889 159.6446 162.7219 487.4810 43.7239 159.0179 17.6488 0.2957 26.5614 29.5387 13.4756 2.1095 37.6445 26.3168 0.1728 13.5730 18.3567 7.4929 20.8337
temp: 298.150 k
press: 1.00000 atm
elementType: 17 7 7 7 6 6 6 6 6 6 6 6 6 6 6 1 1 1 1 1 1 1 1 1 1
symmnumber: 1
zpe: 493265.9 jmol-1
zpe.correction: 0.187875 hartree
zpe.thermalcorrener: 0.201102 hartree
zpe.thermalcorrenthalpy: 0.202046 hartree
zpe.thermalcorrgfe: 0.144887 hartree
zpe.sumelectzpe: -1048.426084 hartree
zpe.sumelectthermal: -1048.412857 hartree
zpe.sumelectthermalent: -1048.411913 hartree
zpe.sumelectthermalfe: -1048.469072 hartree
dipole: -2.4142 2.6142 0.0738
dipole: 3.5592
quadrupole: -84.5052 -90.2367 -96.1831
quadrupole: 7.3821 -0.4634 -0.8406
quadrupole: 5.8031 0.0716 -5.8748 7.3821 -0.4634 -0.8406
hfenergy: -1048.6139589 hartree
pointgroup: C01 [X(C11H10Cl1N3)]
dipole: -0.8336496 1.1202421 0.1047455 debye
dipolederiv: -0.3030125 0.334777 0.0037001 0.4574214 -0.9020375 -0.0069567 -0.0094818 0.0205375 -0.0811904 -1.5826986 -0.1769876 0.0460773 -0.4311226 -0.6003789 0.0336111 0.1406374 0.047779 -0.1478116 -0.7064612 -0.1896067 0.0520274 0.0391964 -1.3793692 -0.0065494 0.0539361 0.0864021 -0.1298286 -1.5023485 0.5976161 0.0607186 0.6256097 -0.8315343 -0.024675 0.0732362 -0.0060386 -0.1274446 -0.0887114 -0.1862062 -0.0477134 -0.2175396 -0.1350221 -0.0582353 -0.2202304 -0.2055251 -0.0305329 -0.8602379 0.0942692 0.0462791 0.1101268 -0.0606894 -0.0083351 0.0586998 -0.0056942 -0.0428943 1.2721961 0.2332572 -0.014926 0.3277396 1.0950205 0.0366682 -0.0625649 -0.0337713 0.0487405 2.1620514 -0.2077053 -0.1084916 -0.2286437 0.6722558 0.0031007 -0.156411 -0.0142008 0.1332167 0.0465007 -0.0215511 -0.0141109 -0.0463699 0.0314324 -0.0141659 0.1468489 0.1418562 0.0498268 0.145959 0.102429 -0.0269396 -0.2553546 0.0056229 0.0089006 -0.0077663 -0.0149962 -0.1068315 0.1653702 -0.1444203 -0.0108628 0.2059803 -0.0205731 -0.0171424 -0.0332528 0.006158 -0.1059859 -0.2526738 -0.1476497 0.015004 -0.2390046 0.1087242 -0.0001463 0.0225698 -0.0045734 -0.1558974 -0.1392078 0.210481 -0.0170776 0.2991817 -0.0009689 -0.0300359 -0.019552 -0.0261299 -0.1508887 0.1304864 -0.0106218 -0.0215509 -0.0093037 0.0508415 -0.0106489 -0.0197277 -0.0103507 -0.1289137 1.3739807 -0.5280802 -0.0672821 -0.6780856 1.9264596 -0.008993 -0.0601957 -0.0669872 0.094696 -0.0215604 0.0092471 0.0940748 0.0408528 0.0512488 -0.0595821 0.0858311 -0.0126553 0.0129362 0.0249814 0.0664758 -0.0820847 0.0299328 -0.0104835 0.0747135 -0.0321128 0.0687199 0.0247844 -0.042108 0.0717283 0.1147677 0.0434357 0.0873729 -0.0417094 0.0685859 -0.0339888 -0.003073 -0.0270808 -0.1552706 -0.0090156 -0.172557 -0.0877443 -0.0085674 -0.0370021 -0.0293573 0.063127 0.0581647 0.0637937 -0.065501 0.1108914 -0.0175735 0.091192 -0.0440994 0.0458816 0.0162993 0.1136389 -0.0835692 0.0104747 -0.0697983 0.0328127 0.0113917 0.0088893 0.0128413 0.1469928 0.1418576 0.05271 -0.0003932 0.042927 0.0092139 0.0062273 -0.0022392 0.0045681 0.1521011 0.0321747 0.0690874 0.0048121 0.1007214 -0.0832955 0.0078193 0.0039426 0.0094076 0.1572713 -0.0123149 -0.0828204 0.0178285 -0.1149012 -0.034032 0.0204516 0.0206389 0.0185586 0.1560672 -0.128946 0.0286174 0.0201849 0.0286636 0.092697 0.0016668 0.0208203 0.0015593 0.1552331 unknown
polarizability: 232.8223712|-11.6100061|171.9736724|-7.5781368|-0.7542532|69.0307483 unknown
InChI: InChI=1S/C11H10ClN3/c1-2-9-13-10(15-11(12)14-9)8-6-4-3-5-7-8/h3-7H,2H2,1H3
charge 0 multiplicity 1
25 atoms
Cl 2.539173 -3.217438 -0.209892
N  0.802687 0.941098 -0.313496
N  2.724782 -0.531801 -0.382326
N  0.50061 -1.457466 -0.154182
C  3.068039 1.907526 -0.506773
C  -1.461076 0.012982 -0.080775
C  2.146595 0.721631 -0.410238
C  0.000556 -0.168432 -0.185866
C  3.510632 2.377746 0.907498
C  -2.021961 1.319171 -0.115361
C  -2.312786 -1.117218 0.05603
C  -3.416964 1.489714 -0.014568
C  -3.706868 -0.940184 0.156832
C  -4.262674 0.361951 0.12182
C  1.83853 -1.542944 -0.252897
H  3.956324 1.618842 -1.093896
H  2.539476 2.72676 -1.023044
H  2.63649 2.675796 1.512805
H  4.186787 3.246116 0.822184
H  4.047359 1.571053 1.436832
H  -1.349505 2.175409 -0.221466
H  -1.863108 -2.114209 0.080731
H  -3.847144 2.496571 -0.04266
H  -4.361094 -1.812077 0.262728
H  -5.347359 0.496904 0.199979
