program: Gaussian 09
title: 000026181
version: EM64L-G09RevD.01
frameworkgroup: C1[X(C8H9NO3)]
method: RPBEPBE
basis: SDD
operation: Freq
keyword: #pfreq=noraman
keyword: PBEPBE/SDD
title: #p freq=noraman PBEPBE/SDD
converged: NO YES NO NO
title: Mulliken charges:
elementType: O O O N C C C C C C C C H H H H H H H H H
charge: -0.442824 -0.313474 -0.268675 -0.459301 0.522366 -0.574720 -0.393617 0.348577 -0.165687 -0.427435 0.264470 -0.493483 0.249139 0.300053 0.225632 0.334144 0.221888 0.355593 0.233114 0.242100 0.242141
chargesum: 0.00000
title: Mulliken charges with hydrogens summed into heavy atoms:
elementType: O O O N C C C C C C C C
charge: -0.087231 -0.313474 -0.268675 -0.125156 0.522366 -0.325582 -0.093564 0.348577 0.059945 -0.205547 0.264470 0.223872
polarizability: 1.69897956e+02 1.14993272e+00 1.05362257e+02 2.38575240e-02 1.38625004e-02 4.75505947e+01
1716.lowfreq: -9.5881 -1.4103 -0.0010 -0.0007 -0.0006 5.4887 52.2304 66.9088 75.2754
frequency: 52.2159 66.8898 75.2670 117.9213 150.7477 226.7889 252.6170 255.5312 282.6687 345.6830 353.8604 424.8881 453.2768 515.2026 594.7512 613.8146 651.8025 667.9012 686.8902 702.8588 757.9623 773.9939 863.0229 879.4382 888.6825 932.8785 974.9752 981.7644 1041.5352 1091.1304 1120.0011 1142.0460 1146.7767 1167.2170 1178.5943 1210.0883 1282.3391 1319.7760 1391.3583 1425.9936 1451.0310 1452.3924 1469.9662 1485.9476 1532.9149 1602.0371 1636.1040 1673.1808 3002.4699 3102.4222 3123.5647 3146.0474 3148.8284 3152.4057 3198.0034 3544.8040 3587.1449
redmass: 2.7919 4.7451 1.4212 4.5102 3.3383 4.7053 4.3351 4.7679 7.9712 5.5829 1.1052 4.0486 2.9573 7.2228 3.0448 6.3912 1.5738 6.1148 2.0106 4.8701 7.1804 1.4093 1.6799 1.4154 6.1256 4.7310 1.3013 6.2262 4.5853 1.6145 1.2552 1.3907 1.6762 2.0249 1.2114 1.5167 2.2986 1.6587 5.9307 1.2209 2.2396 1.0492 1.0726 2.8159 2.3828 5.3661 6.2102 8.2901 1.0299 1.1047 1.0884 1.1042 1.0926 1.0945 1.0950 1.0761 1.0661
irintensity: 0.0000 6.2269 1.3971 2.5946 4.0988 1.4145 10.2740 13.6092 10.4321 6.5630 146.5126 9.5949 6.1184 1.6709 3.8918 3.4288 42.9062 12.9143 38.0186 54.6584 12.8149 51.3051 50.2008 17.6538 31.1801 86.1528 4.0452 1.9114 93.6993 27.1968 0.2504 249.7761 145.3846 166.7851 64.5757 21.8895 83.5773 36.6654 109.6062 6.9133 103.1596 13.5996 19.4831 126.4238 334.5082 97.3622 227.8872 215.2114 47.9874 29.6754 11.7799 18.2020 14.6948 7.4068 5.5210 33.2928 39.9448
temp: 298.150 k
press: 1.00000 atm
elementType: 8 8 8 7 6 6 6 6 6 6 6 6 1 1 1 1 1 1 1 1 1
symmnumber: 1
zpe: 420908.6 jmol-1
zpe.correction: 0.160316 hartree
zpe.thermalcorrener: 0.171846 hartree
zpe.thermalcorrenthalpy: 0.172790 hartree
zpe.thermalcorrgfe: 0.122136 hartree
zpe.sumelectzpe: -589.797646 hartree
zpe.sumelectthermal: -589.786116 hartree
zpe.sumelectthermalent: -589.785172 hartree
zpe.sumelectthermalfe: -589.835826 hartree
dipole: 0.5438 -0.8507 0.0023
dipole: 1.0096
quadrupole: -46.0633 -71.0461 -73.4103
quadrupole: 8.8570 -0.0021 0.0046
quadrupole: 17.4432 -7.5395 -9.9037 8.8570 -0.0021 0.0046
hfenergy: -589.9579621 hartree
pointgroup: C01 [X(C8H9N1O3)]
dipole: 0.2150103 -0.3339979 0.000987 debye
dipolederiv: -0.987584 0.6146484 -0.0003313 0.7512244 -0.6004898 0.0006298 -0.0004026 0.0005832 -0.4322803 -1.792992 -0.262887 0.0009988 -0.6936204 -0.6458909 0.0000456 0.0040956 0.0008423 -0.3333131 -0.8041889 0.0718017 -0.0001685 0.2861124 -0.9080788 0.0014677 0.0015589 -0.0013044 -0.3403019 -2.096922 -0.0346388 0.0001607 0.2102659 -0.3500195 -0.0002544 -0.0005127 -0.0001381 -0.3359127 1.4102398 0.145173 0.0008489 0.5811841 0.333486 0.0003682 0.0011956 0.0003061 0.1194572 -0.6427746 0.1390038 -0.0001739 0.0442134 -0.0234887 0.0001416 -0.000748 0.0001119 -0.2457131 -0.3874724 -0.0677321 -0.0000331 -0.3225426 -0.2553868 -0.0002375 -0.0002436 0.0000006 -0.214339 1.1132967 -0.5019382 0.0007453 -0.6593229 0.6340608 -0.0005045 0.0009872 -0.0004572 0.1044235 0.3415761 0.0323913 0.0003746 -0.0219789 0.1808487 0.0000035 0.0005407 0.0001265 -0.109008 -0.2533239 0.0174859 0.0000922 0.3256529 -0.3333202 0.0002794 0.0000497 -0.0000009 -0.2510844 2.7126289 0.0787336 -0.00062 -0.1650929 1.336268 -0.0017887 -0.0042168 0.0000977 0.3203293 0.8766313 0.0306735 -0.0007535 -0.1461568 0.2172247 0.0002913 -0.0010247 -0.0000463 0.285542 0.0832291 -0.0589458 -0.0001223 -0.0482973 -0.0553606 -0.0000851 -0.0001523 -0.0000975 0.1874573 0.1242488 0.0629185 -0.000127 0.0528562 0.0813648 0.0000116 -0.0002284 -0.0000268 0.1913565 0.0712912 -0.0320014 -0.0000695 -0.0486423 -0.1072774 -0.0000726 -0.0000672 -0.0000746 0.1505145 0.1778978 0.0394417 -0.0002445 0.0028133 0.1668585 0.0000318 -0.0003064 0.0000651 0.3303171 -0.1379574 -0.0447698 -0.0003053 -0.02503 0.0734862 -0.0000426 -0.0003562 -0.0000709 0.1863554 0.2667307 -0.1415642 -0.0001518 -0.2110695 0.2016936 -0.0002193 -0.0001374 -0.0001525 0.386321 -0.036447 -0.0806482 0.0003018 -0.1400798 -0.0394571 0.0003195 0.0004505 0.0002714 0.1244387 -0.0191163 -0.0033254 0.0021916 0.1140681 0.0468096 0.102207 -0.0519217 0.0861649 -0.0622671 -0.0189918 -0.0038205 -0.0026133 0.1134426 0.0466687 -0.1025924 0.0514398 -0.0862004 -0.0622927 unknown
polarizability: 169.8900074|1.3543632|105.3701927|0.048568|0.0081592|47.5506072 unknown
InChI: InChI=1S/C8H9NO3/c1-12-8(11)9-6-3-2-4-7(10)5-6/h2-5,9-10H,1H3
charge 0 multiplicity 1
21 atoms
O  3.721102 -1.481194 0.001761
O  -3.248429 -0.928615 -0.000978
O  -2.42248 1.278068 -0.001244
N  -1.012884 -0.636762 -0.002776
C  0.296206 -0.083127 -0.001306
C  1.378696 -0.998074 -0.000399
C  0.53915 1.317517 -0.000838
C  2.700702 -0.511939 0.000937
C  1.873241 1.773318 0.000528
C  2.965816 0.878788 0.001432
C  -2.220992 0.039018 -0.003746
C  -4.617359 -0.374877 0.002206
H  1.216446 -2.081279 -0.000733
H  -0.299939 2.01469 -0.001562
H  2.065277 2.851819 0.000887
H  -1.092783 -1.655913 -0.002932
H  3.99667 1.253925 0.00249
H  4.611189 -1.050066 0.002686
H  -5.27513 -1.255392 0.004109
H  -4.785914 0.242484 -0.896336
H  -4.781587 0.243111 0.901117
