program: Gaussian 09
title: 000272507
version: EM64L-G09RevD.01
frameworkgroup: C1[X(C13H12Cl2N4)]
method: RPBEPBE
basis: SDD
operation: Freq
keyword: #p
keyword: freq=noraman
keyword: PBEPBE/SDD
title: #p freq=noraman PBEPBE/SDD
converged: YES YES NO NO
title: Mulliken charges:
elementType: Cl Cl N N N N C C C C C C C C C C C C C H H H H H H H H H H H H
charge: 0.005752 -0.031839 -0.354739 -0.397429 -0.078126 -0.043573 -0.187707 -0.514692 0.293894 0.592151 0.139307 -0.436756 -0.315256 -0.441633 0.020278 -0.193879 -0.222333 -0.112347 -0.751791 0.224180 0.207549 0.240833 0.287924 0.323522 0.242016 0.246161 0.284580 0.264028 0.233948 0.244620 0.231356
chargesum: 0.00000
title: Mulliken charges with hydrogens summed into heavy atoms:
elementType: Cl Cl N N N N C C C C C C C C C C C C C
charge: 0.005752 -0.031839 -0.066815 -0.073907 -0.078126 -0.043573 0.036473 -0.066310 0.293894 0.592151 0.139307 -0.194741 -0.315256 -0.195473 0.020278 0.090702 0.041695 -0.112347 -0.041867
polarizability: 2.86871618e+02 9.62862911e+00 1.57817211e+02 -2.03710645e+01 -4.21668070e+00 1.26174685e+02
1716.lowfreq: -0.0030 -0.0028 -0.0028 4.1013 6.2154 15.8370 25.5306 30.0513 45.5205
frequency: 25.4010 29.8582 45.5091 57.0216 111.0165 129.8050 144.7649 164.9078 179.0358 205.4279 206.4745 234.7551 267.7689 303.3166 355.8648 374.2373 397.3263 405.9608 417.1767 427.2916 439.1948 468.8072 488.3172 514.2268 565.9615 570.5675 603.5033 640.5226 657.3558 697.4601 717.5657 727.5444 755.8603 768.3035 811.8729 825.7037 869.1741 869.9724 904.0563 921.2643 952.6253 962.4525 993.7525 1020.9021 1036.6363 1052.6805 1063.1760 1089.0025 1142.8310 1150.7417 1190.5569 1202.9326 1218.1909 1225.2290 1247.7414 1260.1536 1284.9828 1305.0598 1317.2033 1340.0225 1359.3226 1372.7166 1387.6317 1395.4916 1424.0452 1440.4014 1459.6495 1459.8604 1461.8063 1469.0494 1502.5612 1549.8299 1569.7264 1581.8834 1591.3001 2795.2403 2850.3105 2996.0753 3036.5823 3077.1811 3113.7781 3130.1632 3130.9459 3179.1150 3182.0125 3507.5155 3564.9238
redmass: 7.7628 9.1580 1.2669 2.8288 3.9774 6.6855 4.4975 6.3989 12.5238 5.2403 7.0783 6.3202 3.5851 2.7389 3.8661 8.8566 5.9271 2.3011 3.1017 2.7689 4.6435 4.5275 2.7400 1.3046 4.6050 4.6927 7.1096 4.6100 7.3235 5.0710 4.7984 5.8515 5.8020 5.5460 5.0694 1.4340 2.7740 1.5950 4.1834 1.5449 1.5185 2.4777 1.8805 2.0155 3.0376 1.6084 3.3089 2.8077 1.5677 3.4713 3.8144 1.5163 1.7923 4.0154 1.3101 1.4334 1.9934 1.8436 1.7599 2.3045 1.5045 5.3155 1.3709 1.8559 4.0372 1.4626 1.0481 2.5710 1.1411 1.1127 2.9645 5.9866 7.7051 6.1930 7.1456 1.0807 1.0713 1.0375 1.0878 1.0969 1.0924 1.0996 1.0900 1.0948 1.0939 1.0762 1.0776
irintensity: 0.2938 0.3577 0.7421 0.1603 2.8323 0.4104 3.4528 0.0313 0.9260 1.6859 0.5116 0.6650 1.6568 4.9102 7.6880 1.7932 2.6397 4.6657 7.0267 25.5917 21.4395 6.6640 10.0980 177.7687 16.9272 22.3228 6.1490 2.1304 1.2967 15.8170 11.1146 29.6602 5.0124 7.9698 26.6474 40.4407 38.8936 21.9801 4.7210 16.6877 1.3405 3.0309 0.7714 17.6802 24.3736 7.9710 18.2779 38.4336 7.8441 21.0554 8.4106 3.0679 13.2407 16.1519 4.1267 36.7617 13.4935 32.3385 25.9450 12.1543 36.2164 14.1283 3.7224 61.4647 216.8468 50.0970 14.9764 98.1840 24.4272 5.0152 172.9224 161.3287 32.9432 481.0436 31.4913 104.8931 113.5573 14.9006 20.8176 15.9017 25.8903 12.6921 6.2872 0.8938 1.4076 3.0692 43.5002
temp: 298.150 k
press: 1.00000 atm
elementType: 17 17 7 7 7 7 6 6 6 6 6 6 6 6 6 6 6 6 6 1 1 1 1 1 1 1 1 1 1 1 1
symmnumber: 1
zpe: 603792.0 jmol-1
zpe.correction: 0.229972 hartree
zpe.thermalcorrener: 0.247028 hartree
zpe.thermalcorrenthalpy: 0.247972 hartree
zpe.thermalcorrgfe: 0.183240 hartree
zpe.sumelectzpe: -1640.347769 hartree
zpe.sumelectthermal: -1640.330714 hartree
zpe.sumelectthermalent: -1640.329769 hartree
zpe.sumelectthermalfe: -1640.394502 hartree
dipole: 3.3640 3.7680 -1.1116
dipole: 5.1721
quadrupole: -146.0335 -113.1653 -122.3047
quadrupole: 0.2562 -2.0220 -0.1948
quadrupole: -18.8657 14.0025 4.8631 0.2562 -2.0220 -0.1948
hfenergy: -1640.5777415 hartree
pointgroup: C01 [X(C13H12Cl2N4)]
dipole: 1.3716385 -1.2740024 0.7975911 debye
polarizability: 287.3637856|0.1833765|153.4155942|21.1941424|-10.9079869|130.0841337 unknown
InChI: InChI=1S/C13H12Cl2N4/c1-7-16-5-8-6-17-13(19-12(8)18-7)10-3-2-9(14)4-11(10)15/h2-5,13,17,19H,6H2,1H3
charge 0 multiplicity 1
31 atoms
Cl 0.971301 1.051983 -1.927169
Cl 6.197408 0.998573 -0.19187
N  -0.064504 -1.759474 -0.430703
N  -0.605155 0.24579 0.765278
N  -2.736949 1.200556 0.53079
N  -4.605473 -0.089758 -0.348725
C  0.366259 -0.858829 0.654818
C  -1.435751 -2.29528 -0.278163
C  -2.40055 -1.131973 -0.143039
C  1.785541 -0.351731 0.400549
C  -1.921227 0.111312 0.380941
C  -3.755185 -1.160622 -0.49629
C  2.167504 0.469131 -0.692676
C  2.804351 -0.738627 1.308009
C  -4.048115 1.052516 0.16512
C  3.502923 0.884985 -0.879638
C  4.149785 -0.346156 1.148884
C  4.475771 0.466665 0.04743
C  -4.945624 2.252654 0.341729
H  0.388281 -1.393467 1.642473
H  -1.540782 -2.971485 0.608005
H  -1.679532 -2.892832 -1.174886
H  0.646594 -2.458019 -0.667886
H  -0.309537 1.156134 1.119978
H  -4.203372 -2.067957 -0.921025
H  2.529383 -1.366496 2.163862
H  3.770669 1.519356 -1.728082
H  4.917764 -0.65913 1.860614
H  -4.56536 3.10725 -0.24621
H  -5.967084 2.006897 0.015963
H  -4.960332 2.571332 1.399517
