program: Gaussian 09
title: 000272490
version: EM64L-G09RevD.01
frameworkgroup: C1[X(C12H17NO3)]
method: RPBEPBE
basis: SDD
operation: Freq
keyword: #p
keyword: freq=noraman
keyword: PBEPBE/SDD
title: #p freq=noraman PBEPBE/SDD
converged: YES YES NO NO
title: Mulliken charges:
elementType: O O O N C C C C C C C C C C C C H H H H H H H H H H H H H H H H H
charge: -0.284739 -0.266664 -0.246489 -0.370777 -0.130709 -0.490314 -0.341312 0.427810 0.260461 -0.385625 -0.439394 -0.224168 -0.221899 -0.245311 -0.493136 -0.504134 0.231738 0.259939 0.202283 0.292919 0.228077 0.204424 0.268198 0.231032 0.221571 0.222825 0.225073 0.205485 0.206262 0.236013 0.246068 0.231578 0.242911
chargesum: 0.00000
title: Mulliken charges with hydrogens summed into heavy atoms:
elementType: O O O N C C C C C C C C C C C C
charge: -0.284739 -0.266664 -0.246489 -0.077857 0.101029 -0.028092 0.091189 0.427810 0.260461 -0.117427 -0.208362 -0.002597 0.000926 -0.020237 0.154624 0.216423
polarizability: 1.77951887e+02 -6.65270910e+00 1.18136849e+02 2.61830759e+00 -5.81923584e+00 1.34941418e+02
1716.lowfreq: -0.0006 -0.0001 0.0003 2.3614 6.2704 8.7008 21.3577 27.4910 34.3894
frequency: 20.6738 27.3857 34.3326 56.2542 90.6797 97.3247 100.2771 105.0623 112.3081 161.8214 197.6187 211.3471 225.8925 249.8308 295.4455 306.8122 317.8956 365.4650 405.6856 412.6075 473.2599 555.4192 589.8292 617.6106 636.1556 690.4174 708.1613 739.6947 754.9376 797.4212 810.2699 858.2565 886.8087 909.0744 915.1757 969.5511 981.0771 989.4607 993.7312 1005.4733 1026.3014 1058.5775 1072.1773 1083.9898 1098.2134 1112.3794 1124.9896 1137.7084 1146.7366 1159.4384 1169.2667 1180.7648 1195.1396 1206.5402 1217.3916 1238.5228 1280.6185 1310.9131 1326.8787 1356.1579 1379.4040 1390.1726 1420.8259 1437.3034 1440.2381 1452.3335 1457.9982 1463.0994 1463.7572 1465.3434 1478.9839 1480.2480 1490.6338 1593.5824 1615.6006 1636.7281 2877.8994 2897.6728 2932.0849 2960.8596 3006.3249 3008.2780 3008.4179 3024.4116 3107.0055 3109.3771 3112.7219 3122.1165 3136.1213 3150.7330 3150.9084 3162.1835 3430.6775
redmass: 4.9626 3.7929 5.2366 3.6493 2.0590 3.8446 1.3740 2.9101 2.3588 2.7235 2.8059 2.0447 2.4600 3.6159 3.4772 3.5356 4.0729 7.6666 2.9231 3.4731 3.1205 3.2081 4.7353 6.2357 3.6379 2.1392 1.9550 2.2024 2.2141 4.6643 3.9887 1.2513 4.6174 1.8778 1.4745 3.7514 1.3896 5.3580 1.4639 1.7454 2.1517 5.4568 2.4954 2.0864 1.7514 1.2678 1.4795 2.7406 1.4414 1.7418 1.0586 1.1089 2.1475 1.6415 1.9294 1.3584 1.3055 1.3501 1.2724 1.5525 1.6686 3.1095 1.1802 1.1603 2.1367 1.0506 1.0531 1.0545 1.1042 1.1906 1.0888 1.8016 1.2180 6.1828 6.1310 9.4778 1.0715 1.0811 1.0342 1.0561 1.0294 1.1004 1.0891 1.1066 1.0979 1.1046 1.0864 1.0868 1.0924 1.1048 1.0955 1.1005 1.0742
irintensity: 1.2470 0.0937 2.9899 0.4765 4.8442 1.8245 1.9651 0.3535 0.8072 8.4460 2.2367 6.4107 4.1118 5.5262 1.7109 1.7940 17.5072 2.3143 0.9833 1.6905 16.3654 2.2721 3.9449 1.0065 12.5288 74.6048 60.1163 22.5858 55.9450 33.1820 1.4818 0.0872 6.8072 4.7984 2.4673 60.1392 0.9631 1.3120 8.9351 13.2050 14.0152 82.2565 54.0283 32.4026 23.3924 0.0121 12.4424 25.9126 19.2604 35.8063 0.2000 1.3626 77.7161 37.4306 8.6970 61.1320 5.6230 6.4507 11.4543 5.7164 2.8867 1.8154 16.2587 0.8189 7.3386 14.1484 11.0264 13.5774 31.9265 33.6891 7.8824 39.0477 0.9025 0.7890 9.9982 161.1313 70.5495 60.5248 82.6078 53.2897 31.6536 75.9426 10.9922 36.7560 26.6503 24.7924 8.2632 1.0098 30.7474 21.2463 26.4135 19.9017 12.5793
temp: 298.150 k
press: 1.00000 atm
elementType: 8 8 8 7 6 6 6 6 6 6 6 6 6 6 6 6 1 1 1 1 1 1 1 1 1 1 1 1 1 1 1 1 1
symmnumber: 1
zpe: 712036.8 jmol-1
zpe.correction: 0.271200 hartree
zpe.thermalcorrener: 0.288444 hartree
zpe.thermalcorrenthalpy: 0.289388 hartree
zpe.thermalcorrgfe: 0.223233 hartree
zpe.sumelectzpe: -746.635493 hartree
zpe.sumelectthermal: -746.618250 hartree
zpe.sumelectthermalent: -746.617306 hartree
zpe.sumelectthermalfe: -746.683461 hartree
dipole: 2.6259 1.1771 1.8109
dipole: 3.4001
quadrupole: -80.2565 -91.5472 -92.6563
quadrupole: -0.3367 5.5027 -4.5269
quadrupole: 7.8968 -3.3939 -4.5029 -0.3367 5.5027 -4.5269
hfenergy: -746.9066939 hartree
pointgroup: C01 [X(C12H17N1O3)]
dipole: 1.0373533 0.1234061 0.8355249 debye
polarizability: 172.643783|-17.448877|125.6368973|1.9821508|-9.2902531|132.7494735 unknown
InChI: InChI=1S/C12H17NO3/c1-15-9-11(12(14)16-2)13-8-10-6-4-3-5-7-10/h3-7,11,13H,8-9H2,1-2H3
charge 0 multiplicity 1
33 atoms
O  2.600412 2.049408 0.40282
O  2.591354 -2.099543 0.57427
O  1.519855 -2.27736 -1.481224
N  0.446033 0.286102 -0.029038
C  1.822452 -0.038987 -0.476239
C  -0.609638 0.146378 -1.059277
C  2.828699 0.600781 0.490423
C  -1.996849 0.397486 -0.478933
C  1.955796 -1.566294 -0.546919
C  -2.325869 -0.031944 0.832353
C  -2.993554 1.036143 -1.258551
C  -3.626005 0.166308 1.347964
C  -4.296941 1.230869 -0.746629
C  -4.618246 0.796191 0.559997
C  3.444307 2.800339 1.330384
C  2.675706 -3.580977 0.618887
H  2.030504 0.343852 -1.504448
H  -0.556023 -0.88414 -1.460714
H  -0.444351 0.826301 -1.930602
H  0.446915 1.228119 0.388928
H  2.652435 0.241054 1.524168
H  3.868842 0.351199 0.194336
H  -1.547302 -0.512319 1.434332
H  -2.748863 1.38312 -2.270595
H  -3.866692 -0.170695 2.363112
H  -5.056625 1.725782 -1.362668
H  -5.626867 0.950289 0.960215
H  4.521922 2.645127 1.111829
H  3.247119 2.509599 2.383913
H  3.192151 3.86274 1.188426
H  1.66227 -4.014993 0.642242
H  3.224746 -3.802812 1.544525
H  3.212008 -3.960823 -0.266783
