program: Gaussian 09
title: 000272653
version: EM64L-G09RevD.01
frameworkgroup: C1[X(C29H19NO7)]
method: RPBEPBE
basis: SDD
operation: Freq
keyword: #p
keyword: freq=noraman
keyword: PBEPBE/SDD
title: #p freq=noraman PBEPBE/SDD
converged: YES YES NO NO
title: Mulliken charges:
elementType: O O O O O O O N C C C C C C C C C C C C C C C C C C C C C C C C C C C C C H H H H H H H H H H H H H H H H H H H
charge: -0.391416 -0.415893 -0.152320 -0.136961 -0.135103 -0.128405 -0.253848 -0.450462 -0.422859 0.207165 0.232440 0.332533 0.013884 0.044079 -0.174768 -0.155240 0.348036 0.446017 0.296141 0.247160 -0.350388 -0.370222 -0.227776 -0.221842 -0.461237 -0.373453 -0.388859 -0.375917 0.479081 -0.376540 -0.370015 -0.225631 -0.258200 -0.236973 -0.233771 0.223631 -0.780449 0.313519 0.249677 0.258281 0.222129 0.310624 0.292546 0.194825 0.292660 0.296617 0.391536 0.364919 0.238138 0.242208 0.241424 0.248250 0.305476 0.214029 0.260411 0.261113
chargesum: 0.00000
title: Mulliken charges with hydrogens summed into heavy atoms:
elementType: O O O O O O O N C C C C C C C C C C C C C C C C C C C C C C C C C C C C C
charge: 0.000119 -0.050974 -0.152320 -0.136961 -0.135103 -0.128405 -0.253848 -0.144986 -0.109340 0.207165 0.232440 0.332533 0.013884 0.044079 -0.174768 -0.155240 0.348036 0.446017 0.296141 0.247160 -0.100711 -0.111941 -0.227776 -0.221842 -0.239109 -0.062829 -0.096313 -0.181092 0.479081 -0.083880 -0.073399 0.012506 -0.015992 0.004451 0.014480 0.223631 -0.044897
polarizability: 3.99087895e+02 1.48866118e+01 4.02006641e+02 5.48189557e+00 1.34283619e+01 3.25227632e+02
1716.lowfreq: -2.0717 -0.0010 -0.0008 0.0005 3.6971 6.7694 17.3146 22.7401 24.0338
frequency: 17.2857 22.7316 23.9532 28.0694 33.8577 39.1468 57.0263 60.8856 65.3974 77.1530 85.1447 89.2499 98.7075 106.9007 131.4012 134.2475 163.5233 165.7602 182.4672 186.1403 187.0985 242.3296 247.7723 275.6706 277.1017 295.3980 313.9540 342.0707 350.8721 356.0422 364.1267 365.3721 367.6646 373.4967 395.0248 407.3454 409.9135 411.2832 420.3116 441.2494 448.3133 463.1910 467.8882 498.9361 504.9665 520.6879 545.3210 558.9631 568.8543 596.4379 598.4991 615.2147 626.6174 630.9217 639.8019 649.5251 656.0929 660.0741 677.4015 682.9695 702.2726 716.0021 725.0141 736.6841 746.2437 770.7817 780.7919 791.0913 833.0585 836.3376 845.1640 849.0990 862.4799 866.7946 888.8272 894.5762 922.9176 929.7566 933.5619 945.1627 961.5396 972.7015 980.0012 990.5117 993.0693 993.7655 1007.2881 1009.4536 1009.9620 1011.2216 1039.5996 1040.0461 1041.8184 1080.7068 1087.0294 1124.2631 1128.0443 1153.9270 1173.6320 1178.4947 1190.5764 1196.3564 1207.1885 1213.5950 1217.7193 1219.0224 1222.0087 1253.4940 1262.1251 1266.0849 1280.3211 1282.2429 1295.3926 1301.6466 1318.6879 1354.7310 1385.3666 1389.8012 1391.0836 1395.5959 1399.0073 1413.6426 1437.3856 1439.6537 1449.2887 1470.2547 1481.2764 1483.4921 1488.9179 1509.6114 1523.8481 1542.7803 1570.7187 1572.9536 1578.7912 1584.5229 1587.1982 1602.1183 1615.3012 1616.1427 1622.0288 1628.0560 1632.9051 2966.8197 2996.4895 3094.7514 3095.7893 3102.5930 3113.0753 3137.5358 3143.8334 3145.7205 3151.3762 3151.5045 3157.1760 3166.2834 3173.8704 3182.4188 3194.5742 3365.6269 3533.9174 3578.5577
redmass: 7.1365 6.3908 6.7414 8.0272 5.8708 4.9523 12.1243 3.5624 1.5700 4.2485 5.6618 3.0829 4.7466 4.5497 6.1493 5.5516 7.2580 7.7090 5.5209 5.9237 5.5818 5.1347 1.5116 5.6870 5.4562 6.5587 5.9433 5.7033 6.1265 6.4860 7.8497 9.1692 8.7222 4.9068 8.3953 7.0225 4.1615 3.3870 4.9687 3.9728 3.9317 6.9106 8.7339 5.3454 5.4585 4.3575 3.9187 5.3305 5.2689 1.8940 1.5846 5.3574 6.0842 6.3534 6.5548 1.1796 5.9079 5.8008 5.4667 5.4241 5.7705 3.6240 4.3262 4.1337 5.0356 1.5738 5.3472 1.5023 2.3502 2.3818 2.4802 6.3287 1.5538 3.0471 2.8403 2.9336 3.1553 2.7037 5.1892 5.4594 1.4109 1.4084 6.8668 1.4000 1.3550 1.6417 5.2432 1.3953 1.3670 2.6057 2.0231 1.6374 2.2519 3.1462 2.7149 1.9382 1.4327 2.7138 1.1014 1.2413 1.5781 1.2558 2.0091 2.3100 2.5557 2.8427 2.2256 2.0073 2.7956 2.0200 2.0157 1.9263 1.9576 2.5923 1.6506 2.9059 2.1895 1.2491 8.7594 6.8966 2.6981 3.3336 2.3419 2.4885 1.0465 1.0952 2.5971 2.8934 2.0851 2.7719 12.2107 12.7139 8.7794 8.0818 8.0456 6.8356 5.7163 7.7673 8.0683 8.2274 5.1332 5.5043 7.4120 1.0802 1.0363 1.0893 1.0994 1.0991 1.0884 1.0864 1.0954 1.0877 1.0896 1.0912 1.0931 1.0976 1.1004 1.0962 1.0947 1.0658 1.0767 1.0656
irintensity: 0.9895 0.4714 1.9535 2.6576 3.1147 5.3481 0.7281 4.4001 0.4357 1.7105 1.8239 0.7811 2.9578 5.1669 1.6381 0.1296 6.6686 2.0630 0.6066 0.2804 1.9038 2.0804 72.4734 1.9167 9.8646 9.0746 5.6821 3.2846 3.0283 3.8076 8.5115 0.6863 4.8866 1.1829 0.0690 3.9629 0.9366 3.0878 0.9814 15.5740 19.3924 2.2358 1.1459 4.7962 13.1434 9.1073 31.8079 8.2175 3.8659 42.5326 69.6631 5.5868 2.4423 2.1550 2.4500 52.2051 6.7516 8.3210 26.9586 20.7013 11.5475 2.8906 34.7394 1.9726 14.2681 70.6084 3.2949 53.6236 20.1847 14.4290 3.3006 18.5568 14.0380 6.3271 12.9862 11.5552 10.6467 3.5219 9.3652 9.1577 2.2131 2.3168 21.7842 4.1685 4.5591 13.8374 14.4963 0.5817 0.0337 8.7014 0.5294 13.7321 9.8518 25.6739 11.1946 16.0106 21.2578 15.1040 4.5977 23.5344 26.3131 17.9072 19.2548 24.9706 10.8633 62.9732 94.4914 36.7733 47.2555 35.7604 14.8391 63.7070 3.7649 116.2973 37.8377 164.3299 125.6095 63.1626 5.1843 10.4216 68.7901 17.0731 12.5973 12.9689 15.7087 20.0726 27.0584 42.6664 89.1027 494.6109 189.5635 276.5724 6.1467 5.1303 147.3494 39.5653 34.1308 21.6066 21.1505 8.1876 61.4613 77.1727 20.1998 24.6907 13.0549 20.7364 13.8326 10.6961 20.8485 3.7618 12.5108 3.8564 3.5369 6.3099 2.8171 22.1720 21.4632 7.8184 5.9919 646.2190 13.5938 34.7124
temp: 298.150 k
press: 1.00000 atm
elementType: 8 8 8 8 8 8 8 7 6 6 6 6 6 6 6 6 6 6 6 6 6 6 6 6 6 6 6 6 6 6 6 6 6 6 6 6 6 1 1 1 1 1 1 1 1 1 1 1 1 1 1 1 1 1 1 1
symmnumber: 1
zpe: 1071389.7 jmol-1
zpe.correction: 0.408071 hartree
zpe.thermalcorrener: 0.439640 hartree
zpe.thermalcorrenthalpy: 0.440584 hartree
zpe.thermalcorrgfe: 0.342258 hartree
zpe.sumelectzpe: -1695.266356 hartree
zpe.sumelectthermal: -1695.234787 hartree
zpe.sumelectthermalent: -1695.233843 hartree
zpe.sumelectthermalfe: -1695.332169 hartree
dipole: 3.9735 3.5106 8.9282
dipole: 10.3839
quadrupole: -189.0014 -191.1169 -220.3937
quadrupole: 25.7976 -45.3414 -16.0578
quadrupole: 11.1693 9.0538 -20.2231 25.7976 -45.3414 -16.0578
hfenergy: -1695.6744263 hartree
pointgroup: C01 [X(C29H19N1O7)]
dipole: 0.5323077 1.8304964 3.613321 debye
polarizability: 386.5744833|4.9928912|413.0125323|-1.2445585|18.5670132|326.7351518 unknown
InChI: InChI=1S/C29H19NO7/c1-14(31)30-16-12-10-15(11-13-16)21(22-24(32)17-6-2-4-8-19(17)26(34)28(22)36)23-25(33)18-7-3-5-9-20(18)27(35)29(23)37/h2-13,21,30,32-33H,1H3
charge 0 multiplicity 1
56 atoms
O  -0.512721 1.981956 1.261854
O  -0.410404 -0.974549 1.609143
O  -2.352059 -0.666663 -2.341333
O  0.937828 -1.980733 -2.841205
O  -4.847459 0.509556 -1.869581
O  0.827541 -4.73088 -2.303078
O  5.886485 2.2362 1.660107
N  4.722339 3.329309 -0.061738
C  0.030264 0.026499 -1.042314
C  -1.310895 0.660133 -0.637318
C  0.133223 -1.444346 -0.642071
C  1.275467 0.868862 -0.711036
C  -1.506839 1.567913 0.400249
C  -0.133803 -1.92672 0.625148
C  -2.461958 0.219527 -1.43553
C  0.557864 -2.379465 -1.701358
C  -2.813516 2.188683 0.705299
C  -0.115794 -3.360739 0.990965
C  -3.964874 1.841684 -0.060366
C  0.197802 -4.3301 -0.009476
C  1.491772 2.072054 -1.438015
C  2.252248 0.492781 0.245241
C  -3.856787 0.846539 -1.164482
C  0.546051 -3.900969 -1.397664
C  2.625622 2.866226 -1.207043
C  3.399815 1.279355 0.492074
C  -2.937853 3.133101 1.753977
C  -0.404611 -3.812637 2.304153
C  3.593854 2.480535 -0.237477
C  -5.21545 2.438082 0.227407
C  0.200629 -5.70762 0.307029
C  -4.189774 3.724302 2.033046
C  -0.402934 -5.190858 2.612508
C  -5.332256 3.3794 1.271091
C  -0.102701 -6.144705 1.613031
C  5.788633 3.18932 0.832996
C  6.848527 4.284482 0.734856
H  -0.007997 -0.024494 -2.151087
H  0.762765 2.377673 -2.19732
H  2.130809 -0.440756 0.803565
H  2.768818 3.786918 -1.78744
H  4.144047 0.977472 1.230696
H  -2.051539 3.395747 2.336531
H  -0.633162 -3.113996 3.120055
H  -6.077536 2.14662 -0.3814
H  0.447099 -6.414974 -0.491528
H  0.361588 1.55214 1.036379
H  -0.728377 -1.373043 2.456322
H  -4.274598 4.455052 2.8446
H  -0.632564 -5.517407 3.631942
H  -6.300468 3.840959 1.490998
H  -0.101998 -7.212334 1.853547
H  4.754752 4.14598 -0.675884
H  6.602322 5.08781 0.018704
H  6.995682 4.729576 1.733439
H  7.808582 3.827743 0.437291
