program: Gaussian 09
title: 000272506
version: EM64L-G09RevD.01
frameworkgroup: C1[X(C17H19NO3)]
method: RPBEPBE
basis: SDD
operation: Freq
keyword: #p
keyword: freq=noraman
keyword: PBEPBE/SDD
title: #p freq=noraman PBEPBE/SDD
converged: YES YES NO NO
title: Mulliken charges:
elementType: O O O N C C C C C C C C C C C C C C C C C H H H H H H H H H H H H H H H H H H H
charge: -0.295224 -0.283976 -0.288865 -0.389995 -0.545640 0.521049 -0.375725 -0.549059 -0.447292 0.210031 0.212588 -0.329953 0.159756 0.276106 -0.354718 -0.354273 -0.223383 -0.246260 -0.227920 -0.520813 -0.536265 0.225582 0.211462 0.222425 0.262844 0.276121 0.233833 0.326043 0.238548 0.274360 0.232150 0.229826 0.232183 0.229993 0.259058 0.212811 0.229316 0.221834 0.244742 0.226699
chargesum: 0.00000
title: Mulliken charges with hydrogens summed into heavy atoms:
elementType: O O O N C C C C C C C C C C C C C C C C C
charge: -0.295224 -0.283976 -0.288865 -0.063952 -0.108596 0.521049 0.109544 -0.272938 -0.213459 0.210031 0.212588 -0.091405 0.159756 0.276106 -0.080358 -0.122123 0.006443 -0.014077 0.002073 0.180372 0.157009
polarizability: 2.52328798e+02 3.86445851e+00 2.36193494e+02 2.06019797e+01 -2.29873392e+00 1.20418783e+02
1716.lowfreq: -9.2634 0.0001 0.0005 0.0008 2.8951 4.8502 15.2807 19.0573 27.7608
frequency: 14.6225 18.6915 27.7361 47.2237 64.2020 67.0200 69.5386 100.9639 120.8874 140.6708 153.9158 194.6065 199.0286 227.4045 248.7830 266.9477 297.0982 308.9234 336.6720 345.6239 369.4817 403.0471 416.8893 448.7979 454.8135 480.9141 489.6423 512.7779 579.5079 591.2165 614.4800 643.2019 655.4593 685.8637 696.2135 703.7000 712.0712 735.4087 785.6572 795.4351 809.0958 856.5350 864.2484 867.5038 907.9991 930.3302 936.7784 960.7239 984.6108 985.8474 988.9276 1000.8753 1004.7270 1013.4681 1030.9482 1062.9005 1085.7906 1110.0680 1110.7061 1111.5514 1138.7795 1145.5134 1157.2137 1172.1367 1173.4915 1184.6595 1194.5608 1206.2766 1231.6266 1253.6840 1271.3304 1278.2080 1313.7090 1319.2726 1353.7640 1376.9886 1384.2761 1401.2666 1431.3854 1432.5224 1441.1526 1454.9296 1462.2230 1466.6461 1466.9563 1472.2094 1474.3458 1481.9739 1494.8015 1505.6434 1572.8113 1577.5350 1606.5189 1611.2263 1613.7930 2962.2874 2976.1012 2986.4623 2994.9290 3051.4970 3057.7448 3076.2991 3084.6161 3118.5497 3124.7624 3127.2643 3127.6764 3129.8942 3141.4413 3143.9915 3157.9642 3161.0897 3168.6913 3553.5735
redmass: 4.4883 5.3342 4.6449 4.9968 4.6743 2.6540 2.6957 4.5119 2.0862 2.9603 2.5937 3.1297 3.5183 2.7926 1.3856 4.0772 3.6701 3.3216 4.0296 3.7326 3.8263 2.8141 4.0248 3.9631 3.5604 4.0884 4.2334 3.2669 1.4000 3.3762 6.2007 3.9488 5.1560 4.8099 4.1016 1.5235 5.0814 3.7775 2.6453 2.3307 1.6135 1.2885 2.3662 5.0429 1.4846 1.3518 1.4459 3.8070 7.4341 1.4789 4.8614 2.6215 1.3418 2.6543 1.9686 2.8995 1.6212 1.4158 2.0028 1.2569 2.1345 1.6679 1.3968 1.0602 1.5055 1.1997 1.2148 1.9363 1.3108 2.7612 1.8764 2.0043 1.3781 1.3416 1.3920 5.7418 8.9854 2.3333 1.2189 2.1921 1.3407 1.0686 1.1202 1.0513 1.1406 1.5489 1.2921 1.0549 2.4203 2.0845 6.3557 7.2089 6.5027 6.1840 6.7136 1.0326 1.0345 1.0654 1.0606 1.1041 1.1007 1.0991 1.0974 1.0874 1.0981 1.0917 1.1033 1.0869 1.0915 1.0920 1.0957 1.0940 1.1005 1.0770
irintensity: 0.0458 0.4087 3.1296 2.3015 0.8566 4.8427 10.6477 4.0075 2.4755 1.1110 1.1588 4.0086 1.6323 3.1458 0.2069 9.2836 4.7434 10.9247 0.9932 1.6468 3.2398 0.2260 3.2293 4.6076 10.0599 2.6021 4.2956 3.6047 99.4628 38.2978 1.1912 15.2594 4.9272 10.6930 4.7275 92.8373 15.3565 3.4716 20.3993 7.1680 33.9812 1.0219 8.1534 6.3272 21.2872 2.1209 2.9985 37.7641 33.3766 1.8519 0.0673 22.4772 1.4913 25.0065 11.7501 11.1728 22.7697 20.4041 74.5719 4.0327 10.2213 8.1817 10.0597 1.5016 4.6335 13.4836 1.7713 69.1039 8.5377 161.5807 100.2473 110.2401 12.6488 1.2699 27.4338 15.7540 1.4618 12.5797 0.2505 0.4521 19.9594 13.0589 36.9401 13.5638 16.1602 120.4645 50.7829 22.3894 155.8018 205.7550 95.6270 18.9939 75.7068 8.2900 12.7584 69.7909 86.1316 39.7017 37.9691 44.8678 26.8498 6.8348 34.3709 7.2116 29.0416 7.6804 11.7543 2.3065 9.8293 22.1053 15.1017 13.3038 22.2797 22.2872
temp: 298.150 k
press: 1.00000 atm
elementType: 8 8 8 7 6 6 6 6 6 6 6 6 6 6 6 6 6 6 6 6 6 1 1 1 1 1 1 1 1 1 1 1 1 1 1 1 1 1 1 1
symmnumber: 1
zpe: 848852.4 jmol-1
zpe.correction: 0.323311 hartree
zpe.thermalcorrener: 0.343781 hartree
zpe.thermalcorrenthalpy: 0.344725 hartree
zpe.thermalcorrgfe: 0.270786 hartree
zpe.sumelectzpe: -938.080063 hartree
zpe.sumelectthermal: -938.059592 hartree
zpe.sumelectthermalent: -938.058648 hartree
zpe.sumelectthermalfe: -938.132588 hartree
dipole: -5.9295 -1.7792 -1.5783
dipole: 6.3888
quadrupole: -108.2768 -117.7895 -122.8531
quadrupole: -12.3631 2.8424 -3.9289
quadrupole: 8.0296 -1.4830 -6.5466 -12.3631 2.8424 -3.9289
hfenergy: -938.4033738 hartree
pointgroup: C01 [X(C17H19N1O3)]
dipole: 2.2399128 -0.977006 0.5882814 debye
polarizability: 252.0188191|-5.397763|237.3598498|17.6957516|-2.6728609|119.5624063 unknown
InChI: InChI=1S/C17H19NO3/c1-20-15-9-8-13(12-16(15)21-2)10-11-18-17(19)14-6-4-3-5-7-14/h3-9,12,18H,10-11H2,1-2H3
charge 0 multiplicity 1
40 atoms
O  1.704223 -2.200301 -0.906839
O  4.064498 -1.765361 0.63658
O  -3.272672 2.675812 -0.304081
N  -1.279697 1.667485 0.354443
C  0.646596 2.628408 -0.947365
C  1.602434 1.503412 -0.579091
C  -0.450902 2.858301 0.134759
C  1.319993 0.163312 -0.949538
C  2.768203 1.747525 0.185219
C  2.145346 -0.911799 -0.556781
C  3.305572 -0.649602 0.236901
C  3.612179 0.686965 0.585611
C  -2.638323 1.639607 0.078118
C  -3.332217 0.312014 0.273352
C  -4.742288 0.333283 0.424808
C  -2.653355 -0.935763 0.280422
C  -5.461034 -0.866236 0.606176
C  -3.374956 -2.137248 0.456616
C  -4.778506 -2.105961 0.626718
C  2.669431 -3.110293 -1.560073
C  5.219399 -1.519865 1.504305
H  0.144277 2.4139 -1.908427
H  1.201061 3.578786 -1.068405
H  0.028546 3.159684 1.086799
H  -1.136232 3.664354 -0.179096
H  0.449175 -0.07503 -1.570809
H  3.024774 2.77395 0.472906
H  -0.820024 0.828498 0.711044
H  4.502699 0.909397 1.181403
H  -5.247585 1.303949 0.387927
H  -1.570416 -0.995806 0.115252
H  -6.549444 -0.837464 0.728336
H  -2.842557 -3.094641 0.451335
H  -5.335531 -3.039553 0.764339
H  3.515523 -3.334649 -0.891112
H  3.038743 -2.663708 -2.50356
H  2.092439 -4.02143 -1.779813
H  5.981012 -0.896093 0.997253
H  5.636002 -2.515957 1.714222
H  4.912415 -1.03638 2.451747
