program: Gaussian 09
title: 000272498
version: EM64L-G09RevD.01
frameworkgroup: C1[X(C11H13N5O2S)]
method: RPBEPBE
basis: SDD
operation: Freq
keyword: #p
keyword: freq=noraman
keyword: PBEPBE/SDD
title: #p freq=noraman PBEPBE/SDD
converged: YES YES NO NO
title: Mulliken charges:
elementType: S O O N N N N N C C C C C C C C C C C H H H H H H H H H H H H H
charge: 0.828160 -0.559023 -0.552316 -0.127874 -0.129194 -0.642675 -0.647177 -0.589905 -0.014873 -0.311985 -0.232928 -0.259770 0.269309 0.260162 0.451027 -0.365381 -0.370816 -0.799943 0.011541 0.267140 0.279078 0.241864 0.242365 0.229359 0.229761 0.243433 0.369792 0.325282 0.370256 0.324683 0.330278 0.330370
chargesum: 0.00000
title: Mulliken charges with hydrogens summed into heavy atoms:
elementType: S O O N N N N N C C C C C C C C C C C
charge: 0.828160 -0.559023 -0.552316 -0.127874 -0.129194 0.052399 0.047761 0.070742 -0.014873 -0.311985 0.034212 0.019309 0.269309 0.260162 0.451027 -0.123517 -0.128451 -0.097389 0.011541
polarizability: 2.34824004e+02 -1.22693844e+01 1.56386074e+02 1.05522193e+00 -1.16174520e+01 1.87734236e+02
1716.lowfreq: -12.2280 -8.0168 -4.8627 -0.0007 0.0010 0.0018 3.0300 31.4045 33.6428
frequency: -5.4334 31.3816 33.6423 36.7199 78.8310 118.2264 135.1121 205.1813 205.5506 219.2165 223.4663 240.8770 258.5932 269.0713 300.3520 315.2950 329.6565 360.1257 382.7423 403.8210 416.5985 461.0418 468.6695 508.2859 523.7874 534.7202 535.2402 558.0774 566.9072 570.9321 592.2381 621.9186 660.5789 667.4700 704.4905 705.9790 731.3564 735.9301 743.7197 772.7145 782.1791 825.3851 845.5555 873.6184 912.9295 954.5148 960.3287 976.3873 989.5034 993.6568 998.6107 1048.7968 1051.0979 1119.7908 1140.6790 1160.6627 1177.6782 1184.8666 1218.2972 1295.4423 1342.3856 1380.6752 1389.0729 1398.3298 1436.8838 1443.9062 1470.8910 1473.0583 1474.6119 1502.5434 1530.5731 1541.0798 1594.3961 1596.1806 1597.4388 1609.5211 1623.9675 2980.3790 3062.9977 3091.9705 3134.2263 3136.3500 3165.1469 3167.9906 3346.2550 3360.4823 3562.6806 3632.1361 3635.6185 3722.1881
redmass: 3.7805 5.4862 5.8487 1.0136 5.5184 4.7274 6.1366 5.6841 7.7336 6.7165 7.9427 10.3114 9.0958 6.6588 5.9442 4.0747 2.9450 3.6679 3.9583 2.8445 6.2878 4.6302 1.2982 3.3402 5.5528 2.8861 1.1107 1.1205 1.4068 3.9269 6.0038 6.8634 6.3539 6.3176 9.7819 3.1691 1.1562 1.3620 12.0028 3.9721 4.8139 1.3906 1.2585 11.2930 6.2832 1.3224 2.1059 1.3839 1.4420 4.6931 3.1156 1.5953 2.4697 1.2843 3.0211 1.8678 2.6196 1.1440 3.0174 1.2662 5.1646 6.1764 2.9870 1.2216 5.0043 3.6135 1.0984 2.2891 1.0747 2.2475 5.8335 2.3560 3.6417 6.3097 1.5832 1.8096 1.7710 1.0389 1.0948 1.1000 1.0895 1.0896 1.0947 1.0958 1.0597 1.0594 1.0442 1.0919 1.0924 1.1059
irintensity: 0.0014 0.6493 0.2677 0.5985 0.0306 0.1968 0.6717 9.4934 2.6668 8.9612 7.3480 0.4393 5.6746 0.5401 0.6660 0.1998 16.9762 6.1803 1.7907 0.0046 20.1814 49.2763 305.9899 99.3591 0.3724 2.0371 0.9763 27.7707 231.1264 35.8828 34.8013 0.7084 17.7550 0.1495 24.5696 4.0387 3.5462 147.8962 70.3694 229.2594 8.7030 31.3253 4.4689 72.2742 0.1098 0.6257 13.9768 0.4299 0.5570 0.9661 17.2696 25.7199 21.0236 10.2125 0.9634 0.1529 1.4261 10.4995 6.9075 3.9304 25.2831 0.3942 8.5562 14.2996 6.8995 12.9643 15.1821 28.9729 14.1311 38.3334 743.3703 109.0169 50.7554 6.4367 284.6746 844.7962 243.8231 26.7772 18.0635 14.8445 13.5910 10.8720 1.2088 8.1989 30.0489 231.8626 133.6529 95.9655 87.2110 47.3451
temp: 298.150 k
press: 1.00000 atm
elementType: 16 8 8 7 7 7 7 7 6 6 6 6 6 6 6 6 6 6 6 1 1 1 1 1 1 1 1 1 1 1 1 1
symmnumber: 1
zpe: 628891.4 jmol-1
zpe.correction: 0.239532 hartree
zpe.thermalcorrener: 0.257085 hartree
zpe.thermalcorrenthalpy: 0.258029 hartree
zpe.thermalcorrgfe: 0.193736 hartree
zpe.sumelectzpe: -1247.746419 hartree
zpe.sumelectthermal: -1247.728866 hartree
zpe.sumelectthermalent: -1247.727922 hartree
zpe.sumelectthermalfe: -1247.792216 hartree
dipole: -1.3117 -5.5394 -1.1842
dipole: 5.8145
quadrupole: -95.1201 -127.6081 -105.9578
quadrupole: -0.1439 0.8560 -6.1419
quadrupole: 14.4419 -18.0461 3.6042 -0.1439 0.8560 -6.1419
hfenergy: -1247.9859511 hartree
pointgroup: C01 [X(C11H13N5O2S1)]
dipole: -0.4820653 0.0208805 2.2361234 debye
polarizability: 235.0638192|4.3423952|191.3113246|10.4224473|3.8047285|152.5691699 unknown
InChI: InChI=1S/C11H13N5O2S/c1-6-2-4-7(5-3-6)19(17,18)8-9(12)15-11(14)16-10(8)13/h2-5H,12-14H2,1H3
charge 0 multiplicity 1
32 atoms
S  -0.161164 -0.008672 -1.682983
O  -0.221211 -1.45384 -2.483152
O  -0.214226 1.401779 -2.540125
N  2.93234 -1.182434 0.809301
N  2.928397 1.272869 0.75849
N  1.515926 -2.443975 -0.549579
N  1.503975 2.47431 -0.646894
N  4.329997 0.076444 2.187556
C  -1.674272 0.003049 -0.540496
C  1.33971 0.014515 -0.585173
C  -2.105493 1.228656 -0.0080
C  -2.328736 -1.21456 -0.303324
C  1.922683 -1.210491 -0.117493
C  1.918178 1.259253 -0.167212
C  -3.935404 0.009984 1.114295
C  -3.241834 1.217182 0.830111
C  -3.465069 -1.198542 0.536228
C  -5.17594 0.019689 1.988959
C  3.353647 0.054533 1.22106
H  -1.582981 2.160372 -0.245299
H  -1.971822 -2.134522 -0.776449
H  -3.596964 2.158991 1.264169
H  -3.994507 -2.136347 0.740178
H  -5.324662 -0.950249 2.49407
H  -5.121073 0.805059 2.762759
H  -6.081514 0.218098 1.383471
H  0.883346 -2.509814 -1.359679
H  2.000411 -3.252107 -0.163955
H  0.887291 2.501661 -1.472191
H  1.997352 3.29641 -0.303874
H  4.690649 0.971208 2.506282
H  4.69377 -0.803009 2.543248
