program: Gaussian 09
title: 000026173
version: EM64L-G09RevD.01
frameworkgroup: C1[X(C6H4Cl2O2)]
method: RPBEPBE
basis: SDD
operation: Freq
keyword: #p
keyword: freq=noraman
keyword: PBEPBE/SDD
title: #p freq=noraman PBEPBE/SDD
converged: NO NO NO NO
title: Mulliken charges:
elementType: Cl Cl O O C C C C C C H H H H
charge: -0.007145 -0.052037 -0.403423 -0.487929 0.249933 0.256412 -0.209736 -0.351178 -0.248069 -0.058559 0.255964 0.281410 0.392793 0.381563
chargesum: 0.00000
title: Mulliken charges with hydrogens summed into heavy atoms:
elementType: Cl Cl O O C C C C C C
charge: -0.007145 -0.052037 -0.010630 -0.106366 0.249933 0.256412 -0.209736 -0.095214 0.033341 -0.058559
polarizability: 1.27298144e+02 -9.06183249e-01 1.07500290e+02 -5.69598162e-05 1.08463027e-04 3.39423101e+01
1716.lowfreq: -0.0030 0.0006 0.0029 6.2956 13.9299 15.4511 116.0425 141.5271 175.3161
frequency: 116.0324 141.5184 175.3159 229.4204 232.4926 283.5896 288.2252 335.4206 356.1198 390.3475 486.3676 488.7949 512.1118 557.3591 582.4364 698.2333 711.2105 816.6617 818.1734 842.5739 892.2922 1068.2414 1110.1050 1145.6307 1212.2758 1253.5020 1298.6805 1397.3050 1409.7417 1495.6549 1595.6439 1610.6261 3155.6300 3186.4806 3509.8795 3620.6666
redmass: 9.0173 9.6916 19.8951 4.9445 9.4283 1.1402 5.3756 6.4477 15.4716 12.2123 1.1067 6.0650 4.8704 4.0199 5.6588 8.3671 5.8336 1.4318 7.5821 1.3742 9.0561 2.0632 1.5256 1.6879 2.2521 1.8204 1.9709 4.6077 5.8851 3.4027 7.9066 7.6815 1.0929 1.0934 1.0649 1.0668
irintensity: 0.9528 1.4538 0.5188 0.2795 3.9620 175.4356 7.0590 5.4443 2.3017 0.8745 140.3497 5.7006 0.7158 18.2264 23.8233 62.7337 5.0634 38.3737 15.0617 23.3508 137.5197 46.4250 46.3295 83.5919 76.5567 233.4965 59.6597 52.8807 33.4159 119.9982 29.6563 54.6141 1.6039 1.4040 95.6595 68.9805
temp: 298.150 k
press: 1.00000 atm
elementType: 17 17 8 8 6 6 6 6 6 6 1 1 1 1
symmnumber: 1
zpe: 227438.6 jmol-1
zpe.correction: 0.086627 hartree
zpe.thermalcorrener: 0.096045 hartree
zpe.thermalcorrenthalpy: 0.096990 hartree
zpe.thermalcorrgfe: 0.051545 hartree
zpe.sumelectzpe: -1300.864987 hartree
zpe.sumelectthermal: -1300.855569 hartree
zpe.sumelectthermalent: -1300.854624 hartree
zpe.sumelectthermalfe: -1300.900069 hartree
dipole: -1.4212 3.9146 0.0000
dipole: 4.1646
quadrupole: -78.6397 -56.0308 -73.6757
quadrupole: -0.7682 0.0000 0.0000
quadrupole: -9.1910 13.4179 -4.2270 -0.7682 0.0000 0.0000
hfenergy: -1300.9516139 hartree
pointgroup: C01 [X(C6H4Cl2O2)]
dipole: 0.2954421 -1.6116281 0.0000064 debye
dipolederiv: -0.3076197 0.2827631 -0.0000006 0.332199 -0.4992114 0.0000012 -0.0000015 0.0000021 -0.0346539 -0.7991745 -0.0532299 -0.0000015 -0.0576787 -0.1406658 0. -0.0000025 -0.000001 -0.0627931 -1.3237208 -0.3359853 0.0000024 -0.2831004 -0.153341 -0.0000029 -0.0000043 -0.0000041 -0.3862211 -0.3653869 -0.469176 -0.0000032 -0.4552878 -1.258883 0.0000047 0.000003 0.0000178 -0.4402703 1.1101028 0.5459328 -0.0000019 0.2013682 -0.3746983 0.000003 0.0000028 0.0000049 0.0731569 0.1302428 0.1764741 -0.0000019 0.4854167 1.1855868 -0.0000082 -0.0000045 -0.0000226 0.0533527 0.4352719 -0.3769981 0.0000008 -0.5650752 0.8324563 -0.0000019 0.0000025 -0.0000056 -0.0742394 -0.3389372 -0.1293871 0.000003 -0.0099797 -0.1672099 0.0000003 -0.0000002 0.000002 -0.155268 -0.4238253 0.0049865 -0.0000013 0.1463649 -0.2234217 0.0000019 -0.0000008 0.0000041 -0.0944705 1.1150324 0.1272819 0.0000037 -0.008191 0.2104034 -0.0000002 0.0000039 0.0000005 -0.0610873 0.067301 0.0514213 -0.000001 0.053016 -0.0205335 0.0000009 -0.0000015 0.0000029 0.1891138 0.0941659 -0.0283498 -0.0000003 -0.0311912 0.0355659 -0.0000007 -0.0000003 -0.0000014 0.1797304 0.4473942 0.0664032 -0.0000011 0.0822079 0.1970751 0.0000019 0.0000013 0.0000023 0.3977461 0.1591535 0.1378633 0.0000029 0.1099314 0.3768772 0. 0.000002 -0.0000018 0.4159037 unknown
polarizability: 126.4543764|-4.1004889|108.3440579|0.0000381|-0.0001164|33.9423101 unknown
InChI: InChI=1S/C6H4Cl2O2/c7-3-1-4(8)6(10)5(9)2-3/h1-2,9-10H
charge 0 multiplicity 1
14 atoms
Cl -1.618288 2.581247 -0.000014
Cl 3.480183 0.35703 -0.000004
O  -2.508833 -0.318308 -0.00001
O  -0.961288 -2.510432 0.000004
C  -1.127237 -0.154996 -0.000008
C  -0.262999 -1.284831 -0.000015
C  -0.542923 1.128623 -0.000009
C  1.136793 -1.149462 -0.000012
C  0.857854 1.30251 -0.000012
C  1.671535 0.155339 -0.000011
H  1.794884 -2.024476 -0.000004
H  1.289808 2.305762 -0.000007
H  -2.715379 -1.291717 -0.000001
H  -0.35821 -3.291788 0.0000
